cis-1-Methyl-2-propylcyclopentane
- Formula: C9H18
- Molecular weight: 126.2392
- IUPAC Standard InChIKey: ADQJFBQXLAAVQA-DTWKUNHWSA-N
- CAS Registry Number: 932-43-4
- Chemical structure:
View 3d structure (requires JavaScript / HTML 5) - Stereoisomers:
- Other names: Cyclopentane, 1-methyl-2-propyl-, cis-

Phase change data

Data compiled by: Thermodynamics Research Center, NIST Boulder Laboratories, Chris Muzny director
Quantity | Value | Units | Method | Reference | Comment |
---|---|---|---|---|---|
Tfus | 168.3 | K | N/A | Chiurdoglu, 1944 | Uncertainty assigned by TRC = 1. K |
Tfus | 168.3 | K | N/A | Chiurdoglu, 1934 | Uncertainty assigned by TRC = 1. K |

Kovats' RI, non-polar column, isothermal

Column type | Active phase | Temperature (C) | I | Reference | Comment |
---|---|---|---|---|---|
Packed | Squalane | 100. | 892. | Bogoslovsky, Anvaer, et al., 1978 | |
Packed | Squalane | 120. | 897. | Bogoslovsky, Anvaer, et al., 1978 | |
Packed | Squalane | 60. | 884. | Bogoslovsky, Anvaer, et al., 1978 | |
Packed | Squalane | 75. | 887. | Bogoslovsky, Anvaer, et al., 1978 | |
Packed | Squalane | 80. | 888. | Bogoslovsky, Anvaer, et al., 1978 | |
Capillary | Squalane | 100. | 923. | Dielmann, Schwengers, et al., 1974 | Column length: 100. m; Column diameter: 0.25 mm |
Capillary | Squalane | 120. | 927. | Dielmann, Schwengers, et al., 1974 | Column length: 100. m; Column diameter: 0.25 mm |
Capillary | Squalane | 60. | 913. | Dielmann, Schwengers, et al., 1974 | Column length: 100. m; Column diameter: 0.25 mm |
Capillary | Squalane | 80. | 918. | Dielmann, Schwengers, et al., 1974 | Column length: 100. m; Column diameter: 0.25 mm |

References

Chiurdoglu, 1944
Chiurdoglu, G.,
Bull. Soc. Chim. Belg., 1944, 53, 45. [all data]
Chiurdoglu, 1934
Chiurdoglu, G.,
The stereoisomers of 1-methyl-2-propylcyclopentane,
Bull. Soc. Chim. Belg., 1934, 43, 35-48. [all data]
Bogoslovsky, Anvaer, et al., 1978
Bogoslovsky, Yu.N.; Anvaer, B.I.; Vigdergauz, M.S.,
Chromatographic constants in gas chromatography (in Russian), Standards Publ. House, Moscow, 1978, 192. [all data]
Dielmann, Schwengers, et al., 1974
Dielmann, G.; Schwengers, D.; Schomburg, G.,
Gas-chromatographische Retentionsdaten und Strukture chemischer Verbindungen Gesättigte und ungesättigte alkylsubstituierte Cyclopentane und Methylcyclopentane,
Chromatographia, 1974, 7, 5, 215-224, https://doi.org/10.1007/BF02321771
. [all data]