trans-1,2-Diethyl cyclopentane
- Formula: C9H18
- Molecular weight: 126.2392
- IUPAC Standard InChIKey: JKMYLSLBFNMSFP-IUCAKERBSA-N
- CAS Registry Number: 932-40-1
- Chemical structure:
View 3d structure (requires JavaScript / HTML 5) - Stereoisomers:
- Other names: Cyclopentane, 1,2-diethyl-, trans-

Phase change data

Data compiled by: Thermodynamics Research Center, NIST Boulder Laboratories, Chris Muzny director
Quantity | Value | Units | Method | Reference | Comment |
---|---|---|---|---|---|
Tboil | 421.63 | K | N/A | Boord, Perilstein, et al., 1944 | Uncertainty assigned by TRC = 0.6 K |
Quantity | Value | Units | Method | Reference | Comment |
Tfus | 177.6 | K | N/A | Chiurdoglu, 1944 | Uncertainty assigned by TRC = 1. K |
Tfus | 177.6 | K | N/A | Chiurdoglu, 1933 | Uncertainty assigned by TRC = 1. K |

Kovats' RI, non-polar column, isothermal

Column type | Active phase | Temperature (C) | I | Reference | Comment |
---|---|---|---|---|---|
Capillary | Squalane | 50. | 888.8 | Lunskii and Paizanskaya, 1988 | He; Column length: 50. m; Column diameter: 0.22 mm |
Capillary | Squalane | 70. | 892.5 | Lunskii and Paizanskaya, 1988 | He; Column length: 50. m; Column diameter: 0.22 mm |

References

Boord, Perilstein, et al., 1944
Boord, C.E.; Perilstein, W.L.; Greenlee, K.W.,
, Am. Pet. Inst. Hydrocarbon Res. Proj., Sixth Annu. Ref., Ohio State Univ., Aug. 31, 1944. [all data]
Chiurdoglu, 1944
Chiurdoglu, G.,
Bull. Soc. Chim. Belg., 1944, 53, 45. [all data]
Chiurdoglu, 1933
Chiurdoglu, G.,
Stereoisomeric 1,2-diethylcyclopentanes,
Bull. Soc. Chim. Belg., 1933, 42, 347. [all data]