cis-1,2-diethylcyclopentane
- Formula: C9H18
- Molecular weight: 126.2392
- IUPAC Standard InChIKey: JKMYLSLBFNMSFP-DTORHVGOSA-N
- CAS Registry Number: 932-39-8
- Chemical structure:
View 3d structure (requires JavaScript / HTML 5) - Stereoisomers:

Phase change data

Data compiled by: Thermodynamics Research Center, NIST Boulder Laboratories, Chris Muzny director
Quantity | Value | Units | Method | Reference | Comment |
---|---|---|---|---|---|
Tfus | 154.5 | K | N/A | Chiurdoglu, 1944 | Uncertainty assigned by TRC = 1. K |
Tfus | 154.5 | K | N/A | Chiurdoglu, 1933 | Uncertainty assigned by TRC = 1. K |

References

Chiurdoglu, 1944
Chiurdoglu, G.,
Bull. Soc. Chim. Belg., 1944, 53, 45. [all data]
Chiurdoglu, 1933
Chiurdoglu, G.,
Stereoisomeric 1,2-diethylcyclopentanes,
Bull. Soc. Chim. Belg., 1933, 42, 347. [all data]