trans-Cyclooctene
- Formula: C8H14
- Molecular weight: 110.1968
- IUPAC Standard InChIKey: URYYVOIYTNXXBN-OWOJBTEDSA-N
- CAS Registry Number: 931-89-5
- Chemical structure:
View 3d structure (requires JavaScript / HTML 5) - Stereoisomers:
- Other names: Cyclooctene, (E)-

Gas phase thermochemistry data

Data compiled by: Hussein Y. Afeefy, Joel F. Liebman, and Stephen E. Stein
Quantity | Value | Units | Method | Reference | Comment |
---|---|---|---|---|---|
ΔfH°gas | 20. | kJ/mol | Chyd | Roth, Adamczak, et al., 1991 | see Doering, Roth, et al., 1989 |
ΔfH°gas | 19.6 ± 3.0 | kJ/mol | Chyd | Rogers, Von Voithenberg, et al., 1978 |

Phase change data

Data compiled by: Thermodynamics Research Center, NIST Boulder Laboratories, Chris Muzny director
Quantity | Value | Units | Method | Reference | Comment |
---|---|---|---|---|---|
Tfus | 250. | K | N/A | Jones, 1954 | Uncertainty assigned by TRC = 10. K |
Tfus | 214. | K | N/A | Ziegler and Wilms, 1950 | Uncertainty assigned by TRC = 5. K |

Reaction thermochemistry data

Data compiled by: Hussein Y. Afeefy, Joel F. Liebman, and Stephen E. Stein
Individual Reactions
By formula: H2 + C8H14 = C8H16
Quantity | Value | Units | Method | Reference | Comment |
---|---|---|---|---|---|
ΔrH° | -144. ± 0.4 | kJ/mol | Chyd | Roth, Adamczak, et al., 1991 | liquid phase; see Doering, Roth, et al., 1989 |
ΔrH° | -144.0 ± 1.8 | kJ/mol | Chyd | Rogers, Von Voithenberg, et al., 1978 | liquid phase; solvent: Hexane |
ΔrH° | -134.9 ± 0.88 | kJ/mol | Chyd | Turner and Meador, 1957 | liquid phase; solvent: Acetic acid |

Kovats' RI, non-polar column, isothermal

Column type | Active phase | Temperature (C) | I | Reference | Comment |
---|---|---|---|---|---|
Capillary | Squalane | 80. | 899. | Engewald, Epsch, et al., 1974 | N2; Column length: 100. m; Column diameter: 0.23 mm |
Capillary | Squalane | 80. | 899. | Schomburg, 1966 |

References

Roth, Adamczak, et al., 1991
Roth, W.R.; Adamczak, O.; Breuckmann, R.; Lennartz, H.-W.; Boese, R.,
Die Berechnung von Resonanzenergien; das MM2ERW-Kraftfeld,
Chem. Ber., 1991, 124, 2499-2521. [all data]
Doering, Roth, et al., 1989
Doering, W.E.; Roth, W.R.; Bauer, F.; Breuckmann, R.; Ebbrecht, T.; Herbold, M.; Schmidt, R.; Lennartz, H-W.; Lenoir, D.; Boese, R.,
Rotational barriers of strained olefines,
Chem. Ber., 1989, 122, 1263-1266. [all data]
Rogers, Von Voithenberg, et al., 1978
Rogers, D.W.; Von Voithenberg, H.; Allinger, N.L.,
Heats of hydrogenation of the cis and trans isomers of cyclooctene,
J. Org. Chem., 1978, 43, 360-361. [all data]
Jones, 1954
Jones, W.O.,
J. Chem. Soc., 1954, 1954, 1808. [all data]
Ziegler and Wilms, 1950
Ziegler, K.; Wilms, H.,
Polymembered Ring Systems XIII. Eight-membered Cycloolefin Rings,
Justus Liebigs Ann. Chem., 1950, 567, 1-43. [all data]
Turner and Meador, 1957
Turner, R.B.; Meador, W.R.,
Heats of hydrogenation. IV. Hydrogenation of some cis- and trans-cycloolefins,
J. Am. Chem. Soc., 1957, 79, 4133-4136. [all data]