1-Chloro-1-methylcyclohexane
- Formula: C7H13Cl
- Molecular weight: 132.631
- IUPAC Standard InChIKey: OGYBTPYJHQSBBR-UHFFFAOYSA-N
- CAS Registry Number: 931-78-2
- Chemical structure:
View 3d structure (requires JavaScript / HTML 5) - Permanent link for this species. Use this link for bookmarking this species for future reference.

Condensed phase thermochemistry data

Data compiled by: Hussein Y. Afeefy, Joel F. Liebman, and Stephen E. Stein
Quantity | Value | Units | Method | Reference | Comment |
---|---|---|---|---|---|
ΔfH°liquid | -246. ± 1. | kJ/mol | Cm | Arnett and Pienta, 1980 | Hydrochlorination |

Phase change data

Data compiled as indicated in comments:
TRC - Thermodynamics Research Center, NIST Boulder Laboratories, Chris Muzny director
AC - William E. Acree, Jr., James S. Chickos
Quantity | Value | Units | Method | Reference | Comment |
---|---|---|---|---|---|
Tboil | 394. | K | N/A | Schmerling, 1949 | Uncertainty assigned by TRC = 4. K; TRC |
Quantity | Value | Units | Method | Reference | Comment |
Ttriple | 234.52 | K | N/A | Kabo, Kozyro, et al., 1999 | Crystal phase 1 phase; Uncertainty assigned by TRC = 0.1 K; TRC |
Enthalpy of fusion
ΔfusH (kJ/mol) | Temperature (K) | Reference | Comment |
---|---|---|---|
1.63 | 234.5 | Kabo, Blokhin, et al., 1998 | AC |

Reaction thermochemistry data

Data compiled by: Hussein Y. Afeefy, Joel F. Liebman, and Stephen E. Stein
Individual Reactions
By formula: C7H12 + HCl = C7H13Cl
Quantity | Value | Units | Method | Reference | Comment |
---|---|---|---|---|---|
ΔrH° | -56.11 ± 0.88 | kJ/mol | Cm | Arnett and Pienta, 1980 | liquid phase; solvent: Methylene chloride; Hydrochlorination |

References

Arnett and Pienta, 1980
Arnett, E.M.; Pienta, N.J.,
Stabilities of carbonium ions in solution. 12. Heats of formation of alkyl chlorides as an entree to heats of solvation of aliphatic carbonium ions,
J. Am. Chem. Soc., 1980, 102, 3329-3334. [all data]
Schmerling, 1949
Schmerling, L.,
Condensation of Saturated Halidesw with Unsaturated Compounds V. Conden- sation of Cycloalkyl Halides with Ethylene and Vinyl Halides,
J. Am. Chem. Soc., 1949, 71, 698. [all data]
Kabo, Kozyro, et al., 1999
Kabo, G.J. (see Kabo; Kozyro, A.A.; Frenkel, M. (see frenke ml); Blokhin, A.V.,
Solid Phase Transitions of the Cyclohexane Derivatives and the Model of Energy States of Molecules in Plastic Crystals,
Mol. Cryst. Liq. Cryst., 1999, 326, 333-5. [all data]
Kabo, Blokhin, et al., 1998
Kabo, G.J.; Blokhin, A.V.; Kozyro, A.A.; Diky, V.V.; Ivashkevich, L.S.; Krasulin, A.P.; Sevruk, V.M.; Frenkel, Michael,
Thermodynamic properties and phase transitions of 1-methylcyclohexanol and 1-chloro-1-methylcyclohexane,
Thermochimica Acta, 1998, 313, 2, 111-124, https://doi.org/10.1016/S0040-6031(97)00481-4
. [all data]