1,4-Cyclohexanediol, cis-
- Formula: C6H12O2
- Molecular weight: 116.1583
- IUPAC Standard InChIKey: VKONPUDBRVKQLM-OLQVQODUSA-N
- CAS Registry Number: 931-71-5
- Chemical structure:
View 3d structure (requires JavaScript / HTML 5) - Stereoisomers:
- Other names: cis-1,4-Cyclohexanediol; 1,4-Cyclohexanediol, (Z)-; cis-1,4-Dihydroxycyclohexane; cis-cyclohexane-1,4-diol

Phase change data

Data compiled by: Thermodynamics Research Center, NIST Boulder Laboratories, Chris Muzny director
Quantity | Value | Units | Method | Reference | Comment |
---|---|---|---|---|---|
Tfus | 375.15 | K | N/A | Sabatier and Mailhe, 1909 | Uncertainty assigned by TRC = 2. K |

Reaction thermochemistry data

Data compiled by: John E. Bartmess
Individual Reactions
C6H11O2- + =
By formula: C6H11O2- + H+ = C6H12O2
Quantity | Value | Units | Method | Reference | Comment |
---|---|---|---|---|---|
ΔrG° | 1490. ± 8.4 | kJ/mol | IMRE | Chen, Walthall, et al., 2004 | gas phase |

Gas phase ion energetics data

Data compiled by: John E. Bartmess
De-protonation reactions
C6H11O2- + =
By formula: C6H11O2- + H+ = C6H12O2
Quantity | Value | Units | Method | Reference | Comment |
---|---|---|---|---|---|
ΔrG° | 1490. ± 8.4 | kJ/mol | IMRE | Chen, Walthall, et al., 2004 | gas phase |

References

Sabatier and Mailhe, 1909
Sabatier, P.; Mailhe, A.,
New Applications of the General Method of Hydrogenation with Various Metals,
Ann. Chim. Phys., 1909, 16, 70. [all data]
Chen, Walthall, et al., 2004
Chen, X.; Walthall, D.A.; Brauman, J.I.,
Acidities in cyclohexanediols enhanced by intramolecular hydrogen bonds,
J. Am. Chem. Soc., 2004, 126, 39, 12614-12620, https://doi.org/10.1021/ja049780s
. [all data]