Cyclohexene, 1-methoxy-
- Formula: C7H12O
- Molecular weight: 112.1696
- IUPAC Standard InChIKey: HZFQGYWRFABYSR-UHFFFAOYSA-N
- CAS Registry Number: 931-57-7
- Chemical structure:
View 3d structure (requires JavaScript / HTML 5) - Other names: Ether, 1-cyclohexen-1-yl methyl; Cyclohexanone methyl enol ether; 1-Cyclohexen-1-yl methyl ether; 1-Methoxy-1-cyclohexene; 1-Methoxycyclohexene; 2,3,4,5-Tetrahydroanisole

Reaction thermochemistry data

Data compiled by: Hussein Y. Afeefy, Joel F. Liebman, and Stephen E. Stein
Individual Reactions
By formula: H2O + C7H12O = C6H10O + CH4O
Quantity | Value | Units | Method | Reference | Comment |
---|---|---|---|---|---|
ΔrH° | -13.63 ± 0.69 | kJ/mol | Eqk | Hine and Arata, 1976 | liquid phase |

Gas phase thermochemistry data

Data compiled by: Hussein Y. Afeefy, Joel F. Liebman, and Stephen E. Stein
Quantity | Value | Units | Method | Reference | Comment |
---|---|---|---|---|---|
ΔfH°gas | -38.47 | kcal/mol | Eqk | Hine and Arata, 1976 |

Phase change data

Data compiled by: William E. Acree, Jr., James S. Chickos
Quantity | Value | Units | Method | Reference | Comment |
---|---|---|---|---|---|
ΔvapH° | 10.4 ± 0.05 | kcal/mol | GS | Verevkin and Welle, 1998 | Based on data from 274. to 313. K. |
Enthalpy of vaporization
ΔvapH (kcal/mol) | Temperature (K) | Method | Reference | Comment |
---|---|---|---|---|
10.5 ± 0.05 | 294. | GS | Verevkin and Welle, 1998 | Based on data from 274. to 313. K. |

References

Hine and Arata, 1976
Hine, J.; Arata, K.,
Keto-Enol tautomerism. II. The calorimetrical determination of the equilibrium constants for keto-enol tautomerism for cyclohexanone,
Bull. Chem. Soc. Jpn., 1976, 49, 3089-3092. [all data]