Methyleugenol
- Formula: C11H14O2
- Molecular weight: 178.2277
- IUPAC Standard InChIKey: ZYEMGPIYFIJGTP-UHFFFAOYSA-N
- CAS Registry Number: 93-15-2
- Chemical structure:
View 3d structure (requires JavaScript / HTML 5) - Other names: Benzene, 1,2-dimethoxy-4-(2-propenyl)-; Benzene, 4-allyl-1,2-dimethoxy-; Ent 21040; Eugenol methyl ether; Eugenyl methyl ether; Methyl eugenol ether; O-Methyleugenol; Veratrole methyl ether; 1-(3,4-Dimethoxyphenyl)-2-propene; 1-Allyl-3,4-dimethoxybenzene; 1,2-Dimethoxy-4-allylbenzene; 1,3,4-Eugenol methyl ether; 3,4-Dimethoxyallylbenzene; 4-Allyl-1,2-dimethoxybenzene; 4-Allylveratrole; 1,2-Dimethoxy-4-(2-propenyl)benzene; 4-Allyl-1,2-dimethyoxybenzene; Methyl eugenyl ether; o-Methyl eugenol ether; Benzene, 4-(2-propenyl)-1,2-dimethoxy; Eugenol methyl; Benzene, 1,2-dimethoxy-4-(2-propen-1-yl)-; NSC 209528

Phase change data

Data compiled as indicated in comments:
BS - Robert L. Brown and Stephen E. Stein
Quantity | Value | Units | Method | Reference | Comment |
---|---|---|---|---|---|
Tboil | 527.9 | K | N/A | Weast and Grasselli, 1989 | BS |
Reduced pressure boiling point
Tboil (K) | Pressure (bar) | Reference | Comment |
---|---|---|---|
401. to 403. | 0.013 | Frinton Laboratories Inc., 1986 | BS |
Antoine Equation Parameters
log10(P) = A − (B / (T + C))
P = vapor pressure (bar)
T = temperature (K)
View plot Requires a JavaScript / HTML 5 canvas capable browser.
Temperature (K) | A | B | C | Reference | Comment |
---|---|---|---|---|---|
358. to 521. | 5.61829 | 2709.262 | -39.126 | Stull, 1947 | Coefficents calculated by NIST from author's data. |

Van Den Dool and Kratz RI, non-polar column, temperature ramp

Data compiled by: NIST Mass Spectrometry Data Center, William E. Wallace, director

Column type CapillaryCapillaryCapillaryCapillaryCapillary
Active phase HP-5MSHP-5HP-5MSHP-101HP-101
Column length (m) 30.30.30.25.25.
Carrier gas HeN2HeHeliumHe
Substrate
Column diameter (mm) 0.250.250.250.200.2
Phase thickness (μm) 0.250.250.250.200.2
Tstart (C) 60.60.60.70.70.
Tend (C) 250.220.280.200.200.
Heat rate (K/min) 2.5.3.3.3.
Initial hold (min) 8.10. 2.2.
Final hold (min) 30.  15.15.
I 1402.1404.1408.1402.1378.
ReferenceBenkaci-Ali, Baaliouamer, et al., 2007Flamini, Tebano, et al., 2007Kundakovic, Fokialakis, et al., 2007Politeo, Jukic, et al., 2007Politeo, Jukic, et al., 2007, 2
Comment MSDC-RI MSDC-RI MSDC-RI MSDC-RI MSDC-RI
Column type CapillaryCapillaryCapillaryCapillaryCapillary
Active phase DB-5HP-5MSHP-5MSCP Sil 5 CBBP-1
Column length (m) 30.30.30.30.50.
Carrier gas HeHeHeN2
Substrate
Column diameter (mm) 0.220.250.250.250.22
Phase thickness (μm) 0.250.250.250.250.25
Tstart (C) 55.60.80.50.60.
Tend (C) 240.280.300.200.220.
Heat rate (K/min) 3.3.4.5.2.
Initial hold (min) 2.
Final hold (min) 15.   20.
I 1406.1404.1407.21385.1367.
ReferenceSilva, Barbosa, et al., 2007Vagionas, Ngassapa, et al., 2007Zeng, Zhao, et al., 2007Andrianoelisoa H.S., Menut C., et al., 2006Blanc, Bradesi, et al., 2006
Comment MSDC-RI MSDC-RI MSDC-RI MSDC-RI MSDC-RI
Column type CapillaryCapillaryCapillaryCapillaryCapillary
Active phase DB-5HP-5DB-1HP-5MSDB-5
Column length (m) 50.30.30.30.30.
Carrier gas N2N2HeHeHe
Substrate
Column diameter (mm) 0.20.250.250.250.25
Phase thickness (μm) 0.320.250.250.250.25
Tstart (C) 60.60.50.60.50.
Tend (C) 220.220.265.280.250.
Heat rate (K/min) 5.5.2.54.5.
Initial hold (min) 3.10. 5.2.
Final hold (min) 5.
I 1401.1402.1371.1402.1404.
ReferenceEsmaeili, Nematollahi, et al., 2006Flamini, Tebano, et al., 2006Ramezani, Behravan, et al., 2006Saroglou, Dorizas, et al., 2006Su, Ho, et al., 2006
Comment MSDC-RI MSDC-RI MSDC-RI MSDC-RI MSDC-RI
Column type CapillaryCapillaryCapillaryCapillaryCapillary
Active phase HP-5MSDB-5DB-1DB-1HP-5
Column length (m) 30.30.30.25.30.
Carrier gas HeH2  He
Substrate
Column diameter (mm) 0.250.250.320.250.25
Phase thickness (μm) 0.250.250.250.250.25
Tstart (C) 80.35.50.60.60.
Tend (C) 300.270.250.180.260.
Heat rate (K/min) 4.5.2.3.3.
Initial hold (min)   8.10.
Final hold (min)  20. 10.
I 1405.51405.1403.1402.1405.
ReferenceZhao C.X., Li, et al., 2006Alves, Pinto, et al., 2005Dob, Dahmane, et al., 2005bin Jantan, Yalvema, et al., 2005Javidnia, Miri, et al., 2005
Comment MSDC-RI MSDC-RI MSDC-RI MSDC-RI MSDC-RI
Column type CapillaryCapillaryCapillaryCapillaryCapillary
Active phase HP-5MSDB-5DB-5DB-5DB-5
Column length (m) 30.30.30.30.30.
Carrier gas HeHeN2N2N2
Substrate
Column diameter (mm) 0.250.250.250.250.25
Phase thickness (μm) 0.250.250.250.250.25
Tstart (C) 60.40.45.60.60.
Tend (C) 250.260.180.240.240.
Heat rate (K/min) 4.2.2.53.3.
Initial hold (min) 2.5.10.
Final hold (min) 20.20.20.
I 1410.1401.1412.1402.1402.
ReferencePino, Mesa, et al., 2005Senatore, Napolitano, et al., 2005Zhang, Xu, et al., 2005Flamini, Cioni, et al., 2004Flamini, Cioni, et al., 2004
Comment MSDC-RI MSDC-RI MSDC-RI MSDC-RI MSDC-RI
Column type CapillaryCapillaryCapillaryCapillaryCapillary
Active phase Methyl SiliconeBP-1Optima 5DB-5HP-5
Column length (m) 50.30.25.30.30.
Carrier gas HeN2HeHeN2
Substrate
Column diameter (mm) 0.250.320.250.250.25
Phase thickness (μm)  0.250.250.250.25
Tstart (C) 50.60.60.60.60.
Tend (C) 240.220.280.240.220.
Heat rate (K/min) 3.5.3.3.5.
Initial hold (min)     10.
Final hold (min)  13.20.
I 1401.1364.1394.1402.1402.
ReferenceÖzcan and Chalchat, 2004Raina, Kumar, et al., 2004Vérité, Nacer, et al., 2004Flamini, Cioni, et al., 2003Flamini, Luigi Cioni, et al., 2003
Comment MSDC-RI MSDC-RI MSDC-RI MSDC-RI MSDC-RI
Column type CapillaryCapillaryCapillaryCapillaryCapillary
Active phase DB-5HP-5HP-5HP-5MSHP-5
Column length (m) 30.30.30.30.30.
Carrier gas HeHeHeHeHe
Substrate
Column diameter (mm) 0.250.250.250.250.25
Phase thickness (μm) 0.250.250.250.250.25
Tstart (C) 75.60.60.50.60.
Tend (C) 230.240.280.250.280.
Heat rate (K/min) 3.3.3.3.4.
Initial hold (min) 10.   5.
Final hold (min) 20.
I 1396.1402.1400.1402.1399.
ReferenceJantan, Ling, et al., 2003Macchioni, Cioni, et al., 2003Ngassapa, Runyoro, et al., 2003Salido, Altarejos, et al., 2003Skaltsa, Demetzos, et al., 2003
Comment MSDC-RI MSDC-RI MSDC-RI MSDC-RI MSDC-RI
Column type CapillaryCapillaryCapillaryCapillaryCapillary
Active phase HP-5MSHP-5HP-5SE-30RTX-5
Column length (m) 30.30.30.25.30.
Carrier gas  N2 N2He
Substrate
Column diameter (mm) 0.250.250.250.250.25
Phase thickness (μm) 0.250.250.250.250.25
Tstart (C) 50.60.60.60.45.
Tend (C) 280.220.280.180.300.
Heat rate (K/min) 3.5.3.3.3.
Initial hold (min) 5.10.5.10.6.
Final hold (min)    10.10.
I 1401.1403.1401.1372.1405.
ReferenceDemetzos, Angelopoulou, et al., 2002Flamini, Cioni, et al., 2002Fokialakis, Magiatis, et al., 2002bin Jantan, Ayop, et al., 2002Mondello, Zappia, et al., 2002
Comment MSDC-RI MSDC-RI MSDC-RI MSDC-RI MSDC-RI
Column type CapillaryCapillaryCapillaryCapillaryCapillary
Active phase HP-1DB-1DB-5BP-1HP-5
Column length (m) 24.50.30.50.30.
Carrier gas HeHeH2HeHe
Substrate
Column diameter (mm) 0.320.220.250.220.25
Phase thickness (μm) 0.170.250.250.250.25
Tstart (C) 60.60.60.60.50.
Tend (C) 250.220.240.220.280.
Heat rate (K/min) 4.2.3.2.4.
Initial hold (min) 2.   5.
Final hold (min) 20.20. 20.
I 1371.1369.1402.1368.1401.
ReferenceNath, Sarma, et al., 2002Pintore, Usai, et al., 2002Nogueira, Bittrich, et al., 2001Rezzi, Bighelli, et al., 2001Lazari, Skaltsa, et al., 2000
Comment MSDC-RI MSDC-RI MSDC-RI MSDC-RI MSDC-RI
Column type CapillaryCapillaryCapillaryCapillaryCapillary
Active phase SE-30Methyl SiliconeCP Sil 5 CBOV-1BP-1
Column length (m) 50.50.25.25.50.
Carrier gas  N2He He
Substrate
Column diameter (mm) 0.20.250.250.250.22
Phase thickness (μm)  0.17 0.30.25
Tstart (C) 50.80.60.50.60.
Tend (C) 250.200.260.200.220.
Heat rate (K/min) 6.2.5.3.2.
Initial hold (min)    1.
Final hold (min)    20.20.
I 1384.1376.1376.1370.1373.
ReferenceParamonov, Khalilova, et al., 2000Sumathykutty, Rao, et al., 1999Weyerstahl, Marschall, et al., 1999Bicchi, Rubiolo, et al., 1998Tam, An, et al., 1998
Comment MSDC-RI MSDC-RI MSDC-RI MSDC-RI MSDC-RI
Column type CapillaryCapillaryCapillaryCapillaryCapillary
Active phase OV-1OV-101OV-101DB-1OV-101
Column length (m) 25.50.50.60.50.
Carrier gas H2N2N2HeH2
Substrate
Column diameter (mm) 0.250.250.250.250.32
Phase thickness (μm) 0.3  0.25
Tstart (C) 50.80.80.40.50.
Tend (C) 200.200.200.280.200.
Heat rate (K/min) 3.2.2.2.2.
Initial hold (min) 1.  3.
Final hold (min) 20.  10.
I 1370.1371.1372.1360.1369.
ReferenceBicchi, Fresia, et al., 1997Yang, Sugisawa, et al., 1992Yang, Sugisawa, et al., 1992Adedeji, Hartman, et al., 1991Pieribattesti, Smadja, et al., 1988
Comment MSDC-RI MSDC-RI MSDC-RI MSDC-RI MSDC-RI
Column type CapillaryCapillary
Active phase OV-1OV-1
Column length (m) 30.30.
Carrier gas HeHe
Substrate
Column diameter (mm) 0.50.5
Phase thickness (μm) 0.80.8
Tstart (C) 40.40.
Tend (C) 220.220.
Heat rate (K/min) 2.2.
Initial hold (min)
Final hold (min)
I 1368.1373.
ReferenceDe Pooter, Omar, et al., 1985De Pooter, Omar, et al., 1985
Comment MSDC-RI MSDC-RI

Kovats' RI, non-polar column, temperature ramp

Data compiled by: NIST Mass Spectrometry Data Center, William E. Wallace, director

Column type CapillaryCapillaryCapillaryCapillaryCapillary
Active phase DB-5HP-5MSHP-5BP-1BP-1
Column length (m) 30.30.25.25.30.
Carrier gas HeHe N2N2
Substrate
Column diameter (mm) 0.260.250.20.320.32
Phase thickness (μm) 0.250.250.330.250.25
Tstart (C) 60.60.60.60.60.
Tend (C) 246.280.240.220.220.
Heat rate (K/min) 3.2.3.5.5.
Initial hold (min)  8.
Final hold (min)  30. 13.3.
I 1401.1410.1408.1402.1361.
ReferenceAdams, González Elizondo, et al., 2006Hazzit, Baaliouamer, et al., 2006Oliveira, Leitao, et al., 2006Raina, Verma, et al., 2006Srivastava, Srivastava, et al., 2006
Comment MSDC-RI MSDC-RI MSDC-RI MSDC-RI MSDC-RI
Column type CapillaryCapillaryCapillaryCapillaryCapillary
Active phase DB-5HP-5DB-5SE-30HP-5
Column length (m) 30.30.30.30.30.
Carrier gas HeliumHeHeHeHe
Substrate
Column diameter (mm) 0.250.250.250.250.25
Phase thickness (μm) 0.251.0.25 0.25
Tstart (C) 60.40.50.60.60.
Tend (C) 255.250.250.240.200.
Heat rate (K/min) 3.5.0.54.4.
Initial hold (min)  1.5. 1.
Final hold (min)   10. 15.
I 1403.1415.1407.1371.1404.
ReferenceMedina, Lucero, et al., 2005Bouzouita, Kachouri, et al., 2003Viña and Murillo, 2003Juliani, Koroch, et al., 2002Juliani and Simon, 2002
Comment MSDC-RI MSDC-RI MSDC-RI MSDC-RI MSDC-RI
Column type CapillaryCapillaryCapillaryCapillaryCapillary
Active phase BP-1DB-5DB-1SE-54DB-5
Column length (m) 25.30.30.30.30.
Carrier gas N2H2HeHeHe
Substrate
Column diameter (mm) 0.550.200.250.260.26
Phase thickness (μm) 0.25 0.250.250.25
Tstart (C) 60.60.40.60.60.
Tend (C) 220.240.260.246.246.
Heat rate (K/min) 5.3.2.3.3.
Initial hold (min)   5.
Final hold (min) 15. 20.
I 1366.1395.1372.1401.1401.
ReferenceRaina, Srivastava, et al., 2002Moreira, Sousa, et al., 2001Senatore and Rigano, 2001Adams, 2000Adams, 2000, 2
Comment MSDC-RI MSDC-RI MSDC-RI MSDC-RI MSDC-RI
Column type CapillaryCapillaryCapillaryCapillaryCapillary
Active phase PTE-5DB-5SE-30DB-5DB-5
Column length (m) 60.30.25.30.30.
Carrier gas H2HeHe
Substrate
Column diameter (mm) 0.320.260.20.250.25
Phase thickness (μm) 0.30.25
Tstart (C) 60.60.60.60.60.
Tend (C) 285.246.180.240.240.
Heat rate (K/min) 4.33.3.3.3.
Initial hold (min)   10.
Final hold (min)
I 1401.1401.1372.1401.1409.
ReferenceMitic and Dordevic, 2000Adams, 1999Jantan I. and Ahmad A.S., 1999Lopes, Kato, et al., 1999Lopes, Kato, et al., 1999
Comment MSDC-RI MSDC-RI MSDC-RI MSDC-RI MSDC-RI
Column type CapillaryCapillaryCapillaryCapillaryCapillary
Active phase HP-5MSDB-5DB-1DB-1DB-5
Column length (m) 30.30.60.30.30.
Carrier gas HeHeHeHeHe
Substrate
Column diameter (mm) 0.320.250.250.230.25
Phase thickness (μm) 0.250.250.25 0.25
Tstart (C) 70.60.50.50.60.
Tend (C) 250.240.250.200.240.
Heat rate (K/min) 3.4.3.3.3.
Initial hold (min) 5. 5.
Final hold (min)   10.
I 1399.1404.1379.1383.1402.
ReferenceSiani, Ramos, et al., 1999da Silva, Zoghbi, et al., 1999Bylaite, Venskutonis, et al., 1998Fiorini, Fourasté, et al., 1997Tellez, Estell, et al., 1997
Comment MSDC-RI MSDC-RI MSDC-RI MSDC-RI MSDC-RI
Column type CapillaryCapillary
Active phase DB-1BP-1
Column length (m) 28.50.
Carrier gas HeH2
Substrate
Column diameter (mm) 0.250.33
Phase thickness (μm) 0.25
Tstart (C) 50.65.
Tend (C) 270.220.
Heat rate (K/min) 4.5.
Initial hold (min) 1.2.
Final hold (min)
I 1375.1376.
ReferenceSaad, El-Sharkawy, et al., 1995Ekundayo, Laakso, et al., 1988
Comment MSDC-RI MSDC-RI

Kovats' RI, polar column, temperature ramp

Data compiled by: NIST Mass Spectrometry Data Center, William E. Wallace, director

Column type CapillaryCapillaryCapillary
Active phase Carbowax 20MCarbowax 20MDB-Wax
Column length (m) 50.50.30.
Carrier gas  H2N2
Substrate
Column diameter (mm) 0.220.30.25
Phase thickness (μm)  0.15
Tstart (C) 80.70.60.
Tend (C) 200.210.200.
Heat rate (K/min) 2.2.2.
Initial hold (min)   10.
Final hold (min)
I 1962.1978.2003.
ReferenceNishimura, Yamaguchi, et al., 1989Gaydou, Randriamiharisoa, et al., 1986Umano, Shoji, et al., 1986
Comment MSDC-RI MSDC-RI MSDC-RI

Kovats' RI, polar column, isothermal

Data compiled by: NIST Mass Spectrometry Data Center, William E. Wallace, director

Column type Capillary
Active phase Carbowax 20M
Column length (m) 152.
Carrier gas
Substrate
Column diameter (mm) 0.8
Phase thickness (μm)
Temperature (C) 190.
I 2033.
ReferenceKepner, Ellison, et al., 1974
Comment MSDC-RI

Kovats' RI, non-polar column, custom temperature program

Data compiled by: NIST Mass Spectrometry Data Center, William E. Wallace, director

Column type CapillaryCapillary
Active phase DB-5DB-5
Column length (m)  30.
Carrier gas  H2
Substrate
Column diameter (mm)  0.20
Phase thickness (μm)
Program not specifiednot specified
I 1401.1401.
ReferenceBizzo, Lopes, et al., 2001Moreira, Sousa, et al., 2001
Comment MSDC-RI MSDC-RI

References

Weast and Grasselli, 1989
CRC Handbook of Data on Organic Compounds, 2nd Editon, Weast,R.C and Grasselli, J.G., ed(s)., CRC Press, Inc., Boca Raton, FL, 1989, 1. [all data]
Frinton Laboratories Inc., 1986
Frinton Laboratories Inc.,
Catalog Number 11, Frinton Laboratories Inc., Vineland, NJ, 1986, 99. [all data]
Stull, 1947
Stull, Daniel R.,
Vapor Pressure of Pure Substances. Organic and Inorganic Compounds,
Ind. Eng. Chem., 1947, 39, 4, 517-540, https://doi.org/10.1021/ie50448a022
. [all data]