Cyclopentane, 1-ethyl-2-methyl-, cis-
- Formula: C8H16
- Molecular weight: 112.2126
- IUPAC Standard InChIKey: BSKOLJVTLRLTHE-JGVFFNPUSA-N
- CAS Registry Number: 930-89-2
- Chemical structure:
View 3d structure (requires JavaScript / HTML 5) - Stereoisomers:
- Other names: cis-1-Ethyl-2-Methylcyclopentane; cis-1-Methyl-2-ethylcyclopentane; 1-Methyl-cis-2-ethylcyclopentane; c-1-Ethyl-2-methylcyclopentane; 1-Ethyl-2-methylcyclopentane, (Z)-; 1-Ethyl-2-methylcyclopentane, cis

Condensed phase thermochemistry data

Data compiled by: Hussein Y. Afeefy, Joel F. Liebman, and Stephen E. Stein
Quantity | Value | Units | Method | Reference | Comment |
---|---|---|---|---|---|
ΔfH°liquid | -190.8 ± 1.0 | kJ/mol | Ccr | Good, 1971 | |
Quantity | Value | Units | Method | Reference | Comment |
ΔcH°liquid | -5243.89 ± 0.92 | kJ/mol | Ccr | Good, 1971 | Corresponding ΔfHºliquid = -190.8 kJ/mol (simple calculation by NIST; no Washburn corrections) |

Phase change data

Data compiled as indicated in comments:
BS - Robert L. Brown and Stephen E. Stein
TRC - Thermodynamics Research Center, NIST Boulder Laboratories, Chris Muzny director
AC - William E. Acree, Jr., James S. Chickos
Quantity | Value | Units | Method | Reference | Comment |
---|---|---|---|---|---|
Tboil | 401.1 ± 0.1 | K | AVG | N/A | Average of 6 values; Individual data points |
Quantity | Value | Units | Method | Reference | Comment |
Tfus | 190. ± 100. | K | AVG | N/A | Average of 8 values; Individual data points |
Quantity | Value | Units | Method | Reference | Comment |
ΔvapH° | 40.2 | kJ/mol | N/A | Reid, 1972 | AC |
Enthalpy of vaporization
ΔvapH (kJ/mol) | Temperature (K) | Method | Reference | Comment |
---|---|---|---|---|
42.5 | 253. | A | Stephenson and Malanowski, 1987 | Based on data from 238. to 304. K.; AC |
39.3 | 318. | A | Stephenson and Malanowski, 1987 | Based on data from 303. to 403. K.; AC |
41.6 | 273. | IP | Osborn and Douslin, 1974 | Based on data from 238. to 288. K.; AC |
38.3 | 337. | N/A | Forziati, Norris, et al., 1949 | Based on data from 322. to 402. K.; AC |
Antoine Equation Parameters
log10(P) = A − (B / (T + C))
P = vapor pressure (bar)
T = temperature (K)
View plot Requires a JavaScript / HTML 5 canvas capable browser.
Temperature (K) | A | B | C | Reference | Comment |
---|---|---|---|---|---|
238. to 288. | 4.7961 | 1760.951 | -27.21 | Osborn and Douslin, 1974 | Coefficents calculated by NIST from author's data. |
322.00 to 402.17 | 4.04224 | 1395.706 | -55.428 | Forziati, Norris, et al., 1949, 2 | Coefficents calculated by NIST from author's data. |

Kovats' RI, non-polar column, isothermal

Column type | Active phase | Temperature (C) | I | Reference | Comment |
---|---|---|---|---|---|
Capillary | Squalane | 50. | 820.1 | Lunskii and Paizanskaya, 1988 | He; Column length: 50. m; Column diameter: 0.22 mm |
Capillary | Squalane | 70. | 825.3 | Lunskii and Paizanskaya, 1988 | He; Column length: 50. m; Column diameter: 0.22 mm |
Capillary | Squalane | 50. | 820.7 | Krupcik, Cellar, et al., 1986 | Column length: 180. m; Column diameter: 0.25 mm |
Capillary | DB-1 | 60. | 820.3 | Lubeck and Sutton, 1983 | Column length: 60. m; Column diameter: 0.264 mm |
Capillary | DB-1 | 60. | 820.8 | Lubeck and Sutton, 1983 | 60. m/0.259 mm/1. μm |
Capillary | Squalane | 70. | 825.3 | Nabivach and Kirilenko, 1979 | N2; Column length: 50. m |
Capillary | Squalane | 70. | 825.4 | Nabivach and Kirilenko, 1979 | N2; Column length: 50. m |
Capillary | Squalane | 100. | 833. | Dielmann, Schwengers, et al., 1974 | Column length: 100. m; Column diameter: 0.25 mm |
Capillary | Squalane | 60. | 823. | Dielmann, Schwengers, et al., 1974 | Column length: 100. m; Column diameter: 0.25 mm |
Capillary | Squalane | 80. | 828. | Dielmann, Schwengers, et al., 1974 | Column length: 100. m; Column diameter: 0.25 mm |
Capillary | Squalane | 50. | 821. | Rijks and Cramers, 1974 | N2; Column length: 100. m; Column diameter: 0.25 mm |
Capillary | Squalane | 70. | 826. | Rijks and Cramers, 1974 | N2; Column length: 100. m; Column diameter: 0.25 mm |
Capillary | Vacuum Grease Oil (VM-4) | 35. | 820. | Sidorov, Petrova, et al., 1972 | |
Capillary | Vacuum Grease Oil (VM-4) | 45. | 823. | Sidorov, Petrova, et al., 1972 | |
Capillary | Vacuum Grease Oil (VM-4) | 50. | 824. | Sidorov, Petrova, et al., 1972 | |
Capillary | Vacuum Grease Oil (VM-4) | 58. | 826. | Sidorov, Petrova, et al., 1972 | |
Capillary | Vacuum Grease Oil (VM-4) | 68. | 829. | Sidorov, Petrova, et al., 1972 | |
Capillary | Squalane | 70. | 821.1 | Dimov and Schopov, 1971 | Column length: 100. m; Column diameter: 0.25 mm |
Packed | Vacuum Grease Oil (VM-4) | 35. | 820. | Sidorov, Ivanova, et al., 1971 | |
Packed | SE-30 | 130. | 846. | Mitra and Saha, 1970 | N2, Chromosorb W; Column length: 6.1 m |
Packed | Squalane | 27. | 816. | Hively and Hinton, 1968 | He, Chromosorb P; Column length: 15. m; Column diameter: 0.25 mm |
Packed | Squalane | 49. | 821. | Hively and Hinton, 1968 | He, Chromosorb P; Column length: 15. m; Column diameter: 0.25 mm |
Packed | Squalane | 67. | 826. | Hively and Hinton, 1968 | He, Chromosorb P; Column length: 15. m; Column diameter: 0.25 mm |
Packed | Squalane | 86. | 830. | Hively and Hinton, 1968 | He, Chromosorb P; Column length: 15. m; Column diameter: 0.25 mm |

Kovats' RI, non-polar column, temperature ramp

Column type | Active phase | I | Reference | Comment |
---|---|---|---|---|
Capillary | Apiezon L | 837. | Louis, 1971 | N2, 1. K/min; Column length: 50. m; Column diameter: 0.25 mm; Tstart: 60. C |

Van Den Dool and Kratz RI, non-polar column, temperature ramp

Column type | Active phase | I | Reference | Comment |
---|---|---|---|---|
Capillary | Petrocol DH | 820.6 | Censullo, Jones, et al., 2003 | 50. m/0.25 mm/0.5 μm, He, 35. C @ 10. min, 3. K/min, 200. C @ 10. min |
Capillary | SPB-1 | 815.95 | LECO Corporation, 2003 | 30. m/0.25 mm/0.25 μm, 40. C @ 2. min, 10. K/min, 250. C @ 2. min |
Capillary | DB-5 | 827.0 | Xu, van Stee, et al., 2003 | 30. m/0.25 mm/1. μm, He, 2.5 K/min; Tstart: 50. C; Tend: 200. C |
Capillary | OV-101 | 818.9 | Yin, Liu, et al., 2001 | N2, 1. K/min; Column length: 80. m; Column diameter: 0.22 mm; Tstart: 30. C; Tend: 130. C |
Capillary | Petrocol DH | 817. | White, Hackett, et al., 1992 | 100. m/0.25 mm/0.5 μm, He, 1. K/min; Tstart: 30. C; Tend: 220. C |

Normal alkane RI, non-polar column, isothermal

Column type | Active phase | Temperature (C) | I | Reference | Comment |
---|---|---|---|---|---|
Capillary | Squalane | 100. | 832. | Krupcik, Cellar, et al., 1986, 2 | Column length: 180. m; Column diameter: 0.25 mm |
Capillary | Squalane | 40. | 817. | Krupcik, Cellar, et al., 1986, 2 | Column length: 180. m; Column diameter: 0.25 mm |
Capillary | Squalane | 70. | 825. | Krupcik, Cellar, et al., 1986, 2 | Column length: 180. m; Column diameter: 0.25 mm |
Capillary | OV-101 | 50. | 816. | Wu and Lu, 1984 | |
Capillary | OV-101 | 70. | 822. | Wu and Lu, 1984 |

Normal alkane RI, non-polar column, temperature ramp

Column type | Active phase | I | Reference | Comment |
---|---|---|---|---|
Capillary | Polydimethyl siloxane: CP-Sil 5 CB | 790. | Bramston-Cook, 2013 | 60. m/0.25 mm/1.0 μm, Helium, 45. C @ 1.45 min, 3.6 K/min, 210. C @ 2.72 min |
Capillary | PONA | 822. | Zhang, Ding, et al., 2009 | 50. m/0.20 mm/0.50 μm, Nitrogen, 35. C @ 15. min, 2. K/min, 200. C @ 10. min |
Capillary | Squalane | 821.3 | Krupcik, Cellar, et al., 1986 | 0.1 K/min; Column length: 100. m; Column diameter: 0.25 mm |
Capillary | Squalane | 823.2 | Krupcik, Cellar, et al., 1986 | 0.2 K/min; Column length: 100. m; Column diameter: 0.25 mm |
Capillary | Squalane | 826.0 | Krupcik, Cellar, et al., 1986 | 0.4 K/min; Column length: 100. m; Column diameter: 0.25 mm |
Capillary | Squalane | 828.1 | Krupcik, Cellar, et al., 1986 | 0.6 K/min; Column length: 100. m; Column diameter: 0.25 mm |
Capillary | Squalane | 829.8 | Krupcik, Cellar, et al., 1986 | 0.8 K/min; Column length: 100. m; Column diameter: 0.25 mm |
Capillary | Squalane | 831.3 | Krupcik, Cellar, et al., 1986 | 1. K/min; Column length: 100. m; Column diameter: 0.25 mm |
Capillary | Squalane | 820. | Krupcik, Cellar, et al., 1986, 2 | 0.1 K/min; Column length: 180. m; Column diameter: 0.25 mm; Tstart: 40. C |
Capillary | Squalane | 822. | Krupcik, Cellar, et al., 1986, 2 | 0.2 K/min; Column length: 180. m; Column diameter: 0.25 mm; Tstart: 40. C |
Capillary | Squalane | 825. | Krupcik, Cellar, et al., 1986, 2 | 0.4 K/min; Column length: 180. m; Column diameter: 0.25 mm; Tstart: 40. C |
Capillary | Squalane | 827. | Krupcik, Cellar, et al., 1986, 2 | 0.6 K/min; Column length: 180. m; Column diameter: 0.25 mm; Tstart: 40. C |
Capillary | Squalane | 829. | Krupcik, Cellar, et al., 1986, 2 | 0.8 K/min; Column length: 180. m; Column diameter: 0.25 mm; Tstart: 40. C |
Capillary | Squalane | 831. | Krupcik, Cellar, et al., 1986, 2 | 1.0 K/min; Column length: 180. m; Column diameter: 0.25 mm; Tstart: 40. C |

References

Good, 1971
Good, W.D.,
The enthalpies of combustion and formation of n-propylcyclopentane and five methylethylcyclopentanes,
J. Chem. Thermodyn., 1971, 3, 97-103. [all data]
Reid, 1972
Reid, Robert C.,
Handbook on vapor pressure and heats of vaporization of hydrocarbons and related compounds, R. C. Wilhort and B. J. Zwolinski, Texas A Research Foundation. College Station, Texas(1971). 329 pages.$10.00,
AIChE J., 1972, 18, 6, 1278-1278, https://doi.org/10.1002/aic.690180637
. [all data]
Stephenson and Malanowski, 1987
Stephenson, Richard M.; Malanowski, Stanislaw,
Handbook of the Thermodynamics of Organic Compounds, 1987, https://doi.org/10.1007/978-94-009-3173-2
. [all data]
Osborn and Douslin, 1974
Osborn, Ann G.; Douslin, Donald R.,
Vapor-pressure relations for 15 hydrocarbons,
J. Chem. Eng. Data, 1974, 19, 2, 114-117, https://doi.org/10.1021/je60061a022
. [all data]
Forziati, Norris, et al., 1949
Forziati, Alphonse F.; Norris, William R.; Rossini, Frederick D.,
Vapor pressures and boiling points of sixty API-NBS hydrocarbons,
J. RES. NATL. BUR. STAN., 1949, 43, 6, 555-17, https://doi.org/10.6028/jres.043.050
. [all data]
Forziati, Norris, et al., 1949, 2
Forziati, A.F.; Norris, W.R.; Rossini, F.D.,
Vapor Pressures and Boiling Points of Sixty API-NBS Hydrocarbons,
J. Res. Natl. Bur. Stand. (U.S.), 1949, 43, 6, 555-563, https://doi.org/10.6028/jres.043.050
. [all data]