N-Methylmaleimide
- Formula: C5H5NO2
- Molecular weight: 111.0987
- IUPAC Standard InChIKey: SEEYREPSKCQBBF-UHFFFAOYSA-N
- CAS Registry Number: 930-88-1
- Chemical structure:
View 3d structure (requires JavaScript / HTML 5) - Other names: 1H-Pyrrole-2,5-dione, 1-methyl-; Maleimide, N-methyl-; N-Methylmaleinimide

Gas phase thermochemistry data

Data compiled by: Hussein Y. Afeefy, Joel F. Liebman, and Stephen E. Stein
Quantity | Value | Units | Method | Reference | Comment |
---|---|---|---|---|---|
ΔfH°gas | -256.0 ± 1.5 | kJ/mol | Ccb | Roux, Jimenez, et al., 1997 |

Condensed phase thermochemistry data

Data compiled by: Hussein Y. Afeefy, Joel F. Liebman, and Stephen E. Stein
Quantity | Value | Units | Method | Reference | Comment |
---|---|---|---|---|---|
ΔfH°solid | -329.3 ± 1.4 | kJ/mol | Ccb | Roux, Jimenez, et al., 1997 | |
Quantity | Value | Units | Method | Reference | Comment |
ΔcH°solid | -2352.8 ± 1.3 | kJ/mol | Ccb | Roux, Jimenez, et al., 1997 |

Phase change data

Data compiled as indicated in comments:
ALS - Hussein Y. Afeefy, Joel F. Liebman, and Stephen E. Stein
AC - William E. Acree, Jr., James S. Chickos
Quantity | Value | Units | Method | Reference | Comment |
---|---|---|---|---|---|
ΔsubH° | 73.3 ± 0.5 | kJ/mol | V | Roux, Jimenez, et al., 1997 | ALS |
ΔsubH° | 73.3 ± 0.5 | kJ/mol | N/A | Roux, Jimenez, et al., 1997 | AC |
Enthalpy of sublimation
ΔsubH (kJ/mol) | Temperature (K) | Method | Reference | Comment |
---|---|---|---|---|
75.3 ± 0.5 | 282. | ME | Roux, Jimenez, et al., 1997 | Based on data from 276. to 289. K.; AC |

Gas phase ion energetics data

Data compiled by: John E. Bartmess
Electron affinity determinations
EA (eV) | Method | Reference | Comment |
---|---|---|---|
1.114 ± 0.087 | IMRE | Paul and Kebarle, 1989 | ΔGea(423 K) = -25.3±1 kcal/mol, ΔS(est) = -1±1 eu |

References

Roux, Jimenez, et al., 1997
Roux, M.V.; Jimenez, P.; Martin-Luengo, M.A.; Davalos, J.Z.; Sun, Z.; Hosmane, R.S.; Liebman, J.F.,
The elusive antiaromaticity of Maleimides and maleic anhydride: Enthalpies of formation of N-methylmaleimide, N-methylsuccinimide, N-Methylphtalimide, and N-benzoyl-N-methylbenzamide,
J. Org. Chem., 1997, 62, 2732-2737. [all data]
Paul and Kebarle, 1989
Paul, G.; Kebarle, P.,
Electron Affinities of Cyclic Unsaturated Dicarbonyls: Maleic Anhydrides, Maleimides, and Cyclopentendione,
J. Am. Chem. Soc., 1989, 111, 2, 464, https://doi.org/10.1021/ja00184a009
. [all data]