O-Methyl phenethylcarbamothioate

Van Den Dool and Kratz RI, non-polar column, custom temperature program

View large format table.

Column type Active phase I Reference Comment
CapillaryHP-5MS1726.9Andriamaharavo, 201430. m/0.25 mm/0.25 μm, He; Program: 60C (1 min) => 5 C/min => 210C => 10 C/min => 280C (15 min)

Normal alkane RI, non-polar column, temperature ramp

View large format table.

Column type Active phase I Reference Comment
CapillaryHP-11703.Breme K., Fernandez X., et al., 200750. m/0.2 mm/0.5 μm, He, 2. K/min, 250. C @ 120. min; Tstart: 60. C

Normal alkane RI, polar column, temperature ramp

View large format table.

Column type Active phase I Reference Comment
CapillaryHP-20M2827.Breme K., Fernandez X., et al., 200750. m/0.2 mm/0.33 μm, He, 2. K/min, 220. C @ 120. min; Tstart: 60. C

References

Andriamaharavo, 2014
Andriamaharavo, N.R., Retention Data. NIST Mass Spectrometry Data Center., NIST Mass Spectrometry Data Center, 2014. [all data]

Breme K., Fernandez X., et al., 2007
Breme K.; Fernandez X.; Meierhenrich U.J.; Brevard H.; Joulain D., Identification of New, Odor-Active Thiocarbamates in Cress Extracts and Structure-Activity Studies on Synthesized Homologues, J. Agric. Food Chem., 2007, 55, 5, 1932-1938, https://doi.org/10.1021/jf062856e . [all data]