Cyclopropane, butyl-
- Formula: C7H14
- Molecular weight: 98.1861
- IUPAC Standard InChIKey: SXZVSSJONMPJMN-UHFFFAOYSA-N
- CAS Registry Number: 930-57-4
- Chemical structure:
View 3d structure (requires JavaScript / HTML 5) - Other names: Butane, 1-cyclopropyl-; Butylcyclopropane

Phase change data

Data compiled by: Thermodynamics Research Center, NIST Boulder Laboratories, Chris Muzny director
Quantity | Value | Units | Method | Reference | Comment |
---|---|---|---|---|---|
Tboil | 371.15 | K | N/A | Turnbull and Wallis, 1956 | Uncertainty assigned by TRC = 1.5 K |
Tboil | 372.7 | K | N/A | Gragson, Greenlee, et al., 1955 | Uncertainty assigned by TRC = 0.6 K |
Tboil | 372.7 | K | N/A | Gragson, Greenlee, et al., 1955 | Uncertainty assigned by TRC = 0.5 K |
Quantity | Value | Units | Method | Reference | Comment |
Tfus | 148.5 | K | N/A | Gragson, Greenlee, et al., 1955 | Uncertainty assigned by TRC = 0.5 K |
Tfus | 147.4 | K | N/A | Gragson, Greenlee, et al., 1955 | Uncertainty assigned by TRC = 0.5 K |

Kovats' RI, non-polar column, isothermal

Column type | Active phase | Temperature (C) | I | Reference | Comment |
---|---|---|---|---|---|
Packed | Squalane | 60. | 712. | Bogoslovsky, Anvaer, et al., 1978 | |
Packed | Squalane | 80. | 714. | Bogoslovsky, Anvaer, et al., 1978 | |
Capillary | Squalane | 60. | 712.5 | Schomburg and Dielmann, 1973 | Column length: 100. m; Column diameter: 0.25 mm |
Capillary | Squalane | 80. | 713.7 | Schomburg and Dielmann, 1973 | Column length: 100. m; Column diameter: 0.25 mm |

Normal alkane RI, non-polar column, custom temperature program

Column type | Active phase | I | Reference | Comment |
---|---|---|---|---|
Capillary | Squalane | 712. | Chen, 2008 | Program: not specified |

References

Turnbull and Wallis, 1956
Turnbull; Wallis,
J. Org. Chem., 1956, 21, 663. [all data]
Gragson, Greenlee, et al., 1955
Gragson, J.T.; Greenlee, K.W.; Derfer, J.M.; Boord, C.E.,
Cyclopropane Hydrocarbons from γ-Bromo Ethers,
J. Org. Chem., 1955, 20, 275. [all data]