Pyrrolidine, 1-nitroso-
- Formula: C4H8N2O
- Molecular weight: 100.1191
- IUPAC Standard InChIKey: WNYADZVDBIBLJJ-UHFFFAOYSA-N
- CAS Registry Number: 930-55-2
- Chemical structure:
View 3d structure (requires JavaScript / HTML 5) - Other names: N-Nitrosopyrrolidine; 1-Nitrosopyrrolidine; N-Nitrosopyrrolidin; Nitrosopyrrolidine; No-Pyr; NPYR; 1-Pyrrolidinamine, N-nitroso-

Phase change data

Data compiled by: Robert L. Brown and Stephen E. Stein
Quantity | Value | Units | Method | Reference | Comment |
---|---|---|---|---|---|
Tboil | 487.2 | K | N/A | Weast and Grasselli, 1989 |

Normal alkane RI, non-polar column, temperature ramp

Column type | Active phase | I | Reference | Comment |
---|---|---|---|---|
Capillary | OV-101 | 952. | Zenkevich, 2005 | 25. m/0.20 mm/0.10 μm, N2/He, 6. K/min; Tstart: 50. C; Tend: 250. C |

Lee's RI, non-polar column, temperature ramp

Column type | Active phase | I | Reference | Comment |
---|---|---|---|---|
Capillary | DB-5MS | 175.18 | Chen, Keeran, et al., 2002 | 30. m/0.25 mm/0.5 μm, 40. C @ 1. min, 10. K/min; Tend: 310. C |
Capillary | DB-5MS | 176.52 | Chen, Keeran, et al., 2002 | 30. m/0.25 mm/0.5 μm, 40. C @ 1. min, 4. K/min; Tend: 310. C |

References

Weast and Grasselli, 1989
CRC Handbook of Data on Organic Compounds, 2nd Editon, Weast,R.C and Grasselli, J.G., ed(s)., CRC Press, Inc., Boca Raton, FL, 1989, 1. [all data]
Zahradnik, Svatek, et al., 1959
Zahradnik, R.; Svatek, E.; Chvaril, M.,
Nitrosamine sekundarer amine. III. Spektroskopische und polarographische studie,
Collect. Czech. Chem. Commun., 1959, 24, 347-358. [all data]
Zenkevich, 2005
Zenkevich, I.G.,
Experimentally measured retention indices., 2005. [all data]
Chen, Keeran, et al., 2002
Chen, P.H.; Keeran, W.S.; Van Ausdale, W.A.; Schindler, D.R.; Roberts, D.W.,
Application of Lee retention indices to the confirmation of tentatively identified compounds from GC/MS analysis of environmental samples, Technical paper, Analytical Services Division, Environmental ScienceEngineering, Inc, PO Box 1703, Gainesville, FL 32602, 2002, 11. [all data]