1H-Pyrazole, 1-methyl-
- Formula: C4H6N2
- Molecular weight: 82.1038
- IUPAC Standard InChIKey: UQFQONCQIQEYPJ-UHFFFAOYSA-N
- CAS Registry Number: 930-36-9
- Chemical structure:

Phase change data

Data compiled by: Robert L. Brown and Stephen E. Stein
Quantity | Value | Units | Method | Reference | Comment |
---|---|---|---|---|---|
Tboil | 400.2 | K | N/A | Weast and Grasselli, 1989 |

Reaction thermochemistry data

Data compiled by: Robert C. Dunbar
Individual Reactions
By formula: Li+ + C4H6N2 = (Li+ • C4H6N2)
Quantity | Value | Units | Method | Reference | Comment |
---|---|---|---|---|---|
ΔrH° | 49.5 ± 4.5 | kcal/mol | CIDT | Huang and Rodgers, 2002 |
By formula: Na+ + C4H6N2 = (Na+ • C4H6N2)
Quantity | Value | Units | Method | Reference | Comment |
---|---|---|---|---|---|
ΔrH° | 31.4 ± 0.7 | kcal/mol | CIDT | Huang and Rodgers, 2002 |
By formula: K+ + C4H6N2 = (K+ • C4H6N2)
Quantity | Value | Units | Method | Reference | Comment |
---|---|---|---|---|---|
ΔrH° | 22.5 ± 0.9 | kcal/mol | CIDT | Huang and Rodgers, 2002 |

Gas phase ion energetics data

Data evaluated by: Edward P. Hunter and Sharon G. Lias
Quantity | Value | Units | Method | Reference | Comment |
---|---|---|---|---|---|
Proton affinity (review) | 218.0 | kcal/mol | N/A | Hunter and Lias, 1998 | |
Quantity | Value | Units | Method | Reference | Comment |
Gas basicity | 210.3 | kcal/mol | N/A | Hunter and Lias, 1998 |

Ion clustering data

Data compiled by: Robert C. Dunbar
Clustering reactions
By formula: K+ + C4H6N2 = (K+ • C4H6N2)
Quantity | Value | Units | Method | Reference | Comment |
---|---|---|---|---|---|
ΔrH° | 22.5 ± 0.9 | kcal/mol | CIDT | Huang and Rodgers, 2002 |
By formula: Li+ + C4H6N2 = (Li+ • C4H6N2)
Quantity | Value | Units | Method | Reference | Comment |
---|---|---|---|---|---|
ΔrH° | 49.5 ± 4.5 | kcal/mol | CIDT | Huang and Rodgers, 2002 |
By formula: Na+ + C4H6N2 = (Na+ • C4H6N2)
Quantity | Value | Units | Method | Reference | Comment |
---|---|---|---|---|---|
ΔrH° | 31.4 ± 0.7 | kcal/mol | CIDT | Huang and Rodgers, 2002 |

Kovats' RI, non-polar column, isothermal

Column type | Active phase | Temperature (C) | I | Reference | Comment |
---|---|---|---|---|---|
Capillary | OV-101 | 110. | 743. | Golovnya, Kuz'menko, et al., 2000 | He; Phase thickness: 0.4 μm |
Capillary | OV-101 | 110. | 743. | Zhuravleva, 2000 | 50. m/0.3 mm/0.4 μm, He |

References

Weast and Grasselli, 1989
CRC Handbook of Data on Organic Compounds, 2nd Editon, Weast,R.C and Grasselli, J.G., ed(s)., CRC Press, Inc., Boca Raton, FL, 1989, 1. [all data]
Huang and Rodgers, 2002
Huang, H.; Rodgers, M.T.,
Sigma versus Pi interactions in alkali metal ion binding to azoles: Threshold collision-induced dissociation and ab initio theory studies,
J. Phys. Chem. A, 2002, 106, 16, 4277, https://doi.org/10.1021/jp013630b
. [all data]
Hunter and Lias, 1998
Hunter, E.P.; Lias, S.G.,
Evaluated Gas Phase Basicities and Proton Affinities of Molecules: An Update,
J. Phys. Chem. Ref. Data, 1998, 27, 3, 413-656, https://doi.org/10.1063/1.556018
. [all data]
Golovnya, Kuz'menko, et al., 2000
Golovnya, R.V.; Kuz'menko, T.E.; Krikunova, N.I.,
The influence of alkyl substituents on the chromatographic indicator of self-association of N-containing heterocyclic compounds,
Russ. Chem. Bull. (Engl. Transl.), 2000, 49, 2, 321-324, https://doi.org/10.1007/BF02494681
. [all data]
Zhuravleva, 2000
Zhuravleva, I.L.,
Evaluation of the polarity and boiling points of nitrogen-containing heterocyclic compounds by gas chromatography,
Russ. Chem. Bull. (Engl. Transl.), 2000, 49, 2, 325-328, https://doi.org/10.1007/BF02494682
. [all data]