3H-1,2,4-Triazol-3-one, 1,2-dihydro-

Condensed phase thermochemistry data

Data compiled as indicated in comments:
ALS - Hussein Y. Afeefy, Joel F. Liebman, and Stephen E. Stein
DH - Eugene S. Domalski and Elizabeth D. Hearing

Quantity Value Units Method Reference Comment
Δfsolid-142.4 ± 0.7kJ/molCcbFinch, Gardner, et al., 1991crystal phase; ALS
Quantity Value Units Method Reference Comment
Δcsolid-1073.34 ± 0.59kJ/molCcbFinch, Gardner, et al., 1991crystal phase; ALS

Constant pressure heat capacity of solid

Cp,solid (J/mol*K) Temperature (K) Reference Comment
68.9320.Finch, Gardner, et al., 1991T = 320 to 420 K. Cp(c) = 0.00214(T/K) + 0.125 J/kg*K.; DH

Gas phase ion energetics data

Data compiled by: Sharon G. Lias, Rhoda D. Levin, and Sherif A. Kafafi

Ionization energy determinations

IE (eV) Method Reference Comment
9.18PEGuimon, Pfister-Guillouzo, et al., 1975Vertical value

References

Finch, Gardner, et al., 1991
Finch, A.; Gardner, P.J.; Head, A.J.; Majdi, H.S., The enthalpies of formation of 1,2,4-triazol-5-one and 3-nitro-1,2,4-triazol-5-one, J. Chem. Thermodyn., 1991, 23, 1169-1173. [all data]