1,3-Dimethylbicyclo[1.1.0]butane

Condensed phase thermochemistry data

Data compiled by: Hussein Y. Afeefy, Joel F. Liebman, and Stephen E. Stein

Quantity Value Units Method Reference Comment
Δfliquid161. ± 4.2kJ/molChydTurner, Goebel, et al., 1965

Phase change data

Data compiled by: Thermodynamics Research Center, NIST Boulder Laboratories, Chris Muzny director

Quantity Value Units Method Reference Comment
Tboil327.5KN/ATurner, Goebel, et al., 1968Uncertainty assigned by TRC = 1. K

In addition to the Thermodynamics Research Center (TRC) data available from this site, much more physical and chemical property data is available from the following TRC products:

Reaction thermochemistry data

Data compiled by: Hussein Y. Afeefy, Joel F. Liebman, and Stephen E. Stein

Individual Reactions

Hydrogen + 1,3-Dimethylbicyclo[1.1.0]butane = Cyclobutane, 1,3-dimethyl

By formula: H2 + C6H10 = C6H12

Quantity Value Units Method Reference Comment
Δr-169.8 ± 1.5kJ/molChydTurner, Goebel, et al., 1968, 2liquid phase; solvent: Diethyl carbitol

References

Turner, Goebel, et al., 1965
Turner, R.B.; Goebel, P.; Doering, W.v.E.; Coburn, J.F., Jr., Strain in 1,3-dimethylbicyclo[1.1.0]butane, Tetrahedron Lett., 1965, 15, 997-1002. [all data]

Turner, Goebel, et al., 1968
Turner, R.B.; Goebel, P.; Mallon, B.J.; Doering, W. vonE.; Coburn, J.F.; Pomerantz, M., Heats of Hydrogenation VIII. Compounds with Three- and Four-Membered Rings, J. Am. Chem. Soc., 1968, 90, 4315-22. [all data]

Turner, Goebel, et al., 1968, 2
Turner, R.B.; Goebel, P.; Mallon, B.J.; Doering, W.E.; Coburn, J.F., Jr.; Pomerantz, M., Heats of hydrogenation. VIII. Compounds with three- and four-membered rings, J. Am. Chem. Soc., 1968, 90, 4315-4322. [all data]