6-hydroxynaphthalene-2-sulphonic acid
- Formula: C10H8O4S
- Molecular weight: 224.233
- IUPAC Standard InChIKey: VVPHSMHEYVOVLH-UHFFFAOYSA-N
- CAS Registry Number: 93-01-6
- Chemical structure:
View 3d structure (requires JavaScript / HTML 5) - Other names: 2-Naphthalenesulfonic acid, 6-hydroxy-

Condensed phase thermochemistry data

Data compiled by: Hussein Y. Afeefy, Joel F. Liebman, and Stephen E. Stein
Quantity | Value | Units | Method | Reference | Comment |
---|---|---|---|---|---|
ΔfH°solid | -183.9 | kcal/mol | Ccb | Badoche, 1946 | Author's hf298_condensed=-190.0 kcal/mol |
Quantity | Value | Units | Method | Reference | Comment |
ΔcH°solid | -1173.75 | kcal/mol | Ccb | Badoche, 1946 | Author's hf298_condensed=-190.0 kcal/mol |

References

Badoche, 1946
Badoche, M.,
No 2. - Chaleurs de combustion d'acides naphtosulfoniques et de leurs sels d'ammonium,
Bull. Soc. Chim. Fr., 1946, 37-43. [all data]