1,1'-Biphenyl, 4-nitro-
- Formula: C12H9NO2
- Molecular weight: 199.2054
- IUPAC Standard InChIKey: BAJQRLZAPXASRD-UHFFFAOYSA-N
- CAS Registry Number: 92-93-3
- Chemical structure:
View 3d structure (requires JavaScript / HTML 5) - Other names: Biphenyl, 4-nitro-; p-Nitrobiphenyl; p-Nitrodiphenyl; Ba 2794; 1-Nitro-4-phenylbenzene; 4-Nitrobiphenyl; 4-Nitrodiphenyl; p-Phenylnitrobenzene; PNB; 4-Phenylnitrobenzene; NSC 1324

Condensed phase thermochemistry data

Data compiled by: Hussein Y. Afeefy, Joel F. Liebman, and Stephen E. Stein
Quantity | Value | Units | Method | Reference | Comment |
---|---|---|---|---|---|
ΔcH°solid | -6048.8 ± 6.3 | kJ/mol | Ccb | Brull, 1935 | Reanalyzed by Cox and Pilcher, 1970, Original value = -6054.25 kJ/mol |

Phase change data

Data compiled by: Robert L. Brown and Stephen E. Stein
Reduced pressure boiling point
Tboil (K) | Pressure (bar) | Reference |
---|---|---|
497.2 | 0.040 | Weast and Grasselli, 1989 |

Gas phase ion energetics data

Data compiled by: John E. Bartmess
Electron affinity determinations
EA (eV) | Method | Reference | Comment |
---|---|---|---|
1.20 ± 0.10 | IMRE | Chowdhury, Kishi, et al., 1989 | ΔGea(423 K) = -26.9 kcal/mol, ΔS = -2 eu est |

Kovats' RI, non-polar column, isothermal

Column type | Active phase | Temperature (C) | I | Reference | Comment |
---|---|---|---|---|---|
Capillary | SE-30 | 180. | 1816. | Korhonen and Lind, 1985 | N2; Column length: 25. m; Column diameter: 0.33 mm |
Capillary | SE-30 | 220. | 1856. | Korhonen and Lind, 1985 | N2; Column length: 25. m; Column diameter: 0.33 mm |

Van Den Dool and Kratz RI, non-polar column, temperature ramp

Column type | Active phase | I | Reference | Comment |
---|---|---|---|---|
Capillary | SE-30 | 1834. | Korhonen and Lind, 1985 | N2, 10. K/min; Column length: 25. m; Column diameter: 0.33 mm; Tstart: 100. C; Tend: 320. C |
Capillary | SE-30 | 1832. | Korhonen and Lind, 1985 | N2, 6. K/min; Column length: 25. m; Column diameter: 0.33 mm; Tstart: 140. C; Tend: 320. C |

Normal alkane RI, non-polar column, isothermal

Column type | Active phase | Temperature (C) | I | Reference | Comment |
---|---|---|---|---|---|
Capillary | SE-30 | 200. | 1839. | Korhonen and Lind, 1985 | N2; Column length: 25. m; Column diameter: 0.33 mm |

Normal alkane RI, non-polar column, custom temperature program

Column type | Active phase | I | Reference | Comment |
---|---|---|---|---|
Capillary | OV-1, SE-30, Methyl silicone, SP-2100, OV-101, DB-1, etc. | 1834. | Waggott and Davies, 1984 | Hydrogen; Column length: 50. m; Column diameter: 0.32 mm; Program: not specified |

Lee's RI, non-polar column, temperature ramp

Column type | Active phase | I | Reference | Comment |
---|---|---|---|---|
Capillary | SE-52 | 313.20 | White, Robbat, et al., 1983 | 30. m/0.3 mm/0.25 μm, He, 4. K/min; Tstart: 25. C; Tend: 295. C |
Capillary | SE-52 | 312.68 | White, Robbat, et al., 1983 | 30. m/0.2 mm/0.25 μm, He, 4. K/min; Tstart: 25. C; Tend: 295. C |
Capillary | SE-52 | 312.72 | White, Robbat, et al., 1983 | 30. m/0.3 mm/0.25 μm, He, 4. K/min; Tstart: 100. C; Tend: 300. C |
Capillary | SE-52 | 313.14 | White, Robbat, et al., 1983 | 30. m/0.3 mm/0.25 μm, He, 4. K/min; Tstart: 40. C; Tend: 300. C |
Capillary | SE-52 | 313.35 | White, Robbat, et al., 1983 | 30. m/0.3 mm/0.25 μm, He, 4. K/min; Tstart: 70. C; Tend: 300. C |
Capillary | SE-52 | 314.59 | Vassilaros, Kong, et al., 1982 | 20. m/0.30 mm/0.25 μm, H2, 40. C @ 2. min, 4. K/min; Tend: 265. C |

Lee's RI, non-polar column, custom temperature program

Column type | Active phase | I | Reference | Comment |
---|---|---|---|---|
Capillary | OV-101 | 312.3 | Tucminen, Wickstrom, et al., 1986 | Program: not specified |

References

Brull, 1935
Brull, L.,
Sui calori di combustione di alcuni derivati del bifenil,
Gazz. Chim. Ital., 1935, 65, 19-28. [all data]
Cox and Pilcher, 1970
Cox, J.D.; Pilcher, G.,
Thermochemistry of Organic and Organometallic Compounds, Academic Press, New York, 1970, 1-636. [all data]
Weast and Grasselli, 1989
CRC Handbook of Data on Organic Compounds, 2nd Editon, Weast,R.C and Grasselli, J.G., ed(s)., CRC Press, Inc., Boca Raton, FL, 1989, 1. [all data]
Chowdhury, Kishi, et al., 1989
Chowdhury, S.; Kishi, H.; Dillow, G.W.; Kebarle, P.,
Electron Affinities of Substituted Nitrobenzenes,
Can. J. Chem., 1989, 67, 4, 603, https://doi.org/10.1139/v89-091
. [all data]
Grammaticakis, 1955
Grammaticakis, P.,
Remarques sur l'absorption des derives du diphenyle dans l'ultraviolet moyen et le visible,
Compt. Rend., 1955, 241, 59-61. [all data]
Korhonen and Lind, 1985
Korhonen, I.O.O.; Lind, M.A.,
Gas-liquid chromatographic analyses. XXXIV. Separation and retention indices with retention increments of some nitrated polynuclear aromatic hydrocarbons on a low-polarity (SE-30) capillary column,
J. Chromatogr., 1985, 322, 71-81, https://doi.org/10.1016/S0021-9673(01)97660-5
. [all data]
Waggott and Davies, 1984
Waggott, A.; Davies, I.W.,
Identification of organic pollutants using linear temperature programmed retention indices (LTPRIs) - Part II, 1984, retrieved from http://dwi.defra.gov.uk/research/completed-research/reports/dwi0383.pdf. [all data]
White, Robbat, et al., 1983
White, C.M.; Robbat, A., Jr.; Hoes, R.M.,
Gas chromatographic retention characteristics of nitrated polycyclic aromatic hydrocarbons on SE-52,
Chromatographia, 1983, 17, 11, 605-612, https://doi.org/10.1007/BF02261944
. [all data]
Vassilaros, Kong, et al., 1982
Vassilaros, D.L.; Kong, R.C.; Later, D.W.; Lee, M.L.,
Linear retention index system for polycyclic aromatic compounds. Critical evaluation and additional indices,
J. Chromatogr., 1982, 252, 1-20, https://doi.org/10.1016/S0021-9673(01)88394-1
. [all data]
Tucminen, Wickstrom, et al., 1986
Tucminen, A.; Wickstrom, K.; Pyysalo, H.,
Determination of Polycyclic Aromatic Compounds by GLC-Selected Ion Monitoring (SIM) Technique,
J. Hi. Res. Chromatogr. Chromatogr. Comm., 1986, 9, 8, 469-471, https://doi.org/10.1002/jhrc.1240090813
. [all data]