1,5-Pentanedithiol
- Formula: C5H12S2
- Molecular weight: 136.279
- IUPAC Standard InChIKey: KMTUBAIXCBHPIZ-UHFFFAOYSA-N
- CAS Registry Number: 928-98-3
- Chemical structure:
View 3d structure (requires JavaScript / HTML 5) - Other names: 1,5-Dimercaptopentane; pentane-1,5-dithiol

Gas phase thermochemistry data

Data compiled by: Hussein Y. Afeefy, Joel F. Liebman, and Stephen E. Stein
Quantity | Value | Units | Method | Reference | Comment |
---|---|---|---|---|---|
ΔfH°gas | -71.0 ± 1.5 | kJ/mol | Ccb | Mansson and Sunner, 1962 | hf298_H2SO4.115=-212.24 kcal/mol |

Condensed phase thermochemistry data

Data compiled by: Hussein Y. Afeefy, Joel F. Liebman, and Stephen E. Stein
Quantity | Value | Units | Method | Reference | Comment |
---|---|---|---|---|---|
ΔfH°liquid | -130.3 ± 1.3 | kJ/mol | Ccb | Mansson and Sunner, 1962 | hf298_H2SO4.115=-212.24 kcal/mol |
Quantity | Value | Units | Method | Reference | Comment |
ΔcH°liquid | -4757.1 ± 1.2 | kJ/mol | Ccb | Mansson and Sunner, 1962 | hf298_H2SO4.115=-212.24 kcal/mol |

Phase change data

Data compiled as indicated in comments:
BS - Robert L. Brown and Stephen E. Stein
ALS - Hussein Y. Afeefy, Joel F. Liebman, and Stephen E. Stein
DRB - Donald R. Burgess, Jr.
AC - William E. Acree, Jr., James S. Chickos
Quantity | Value | Units | Method | Reference | Comment |
---|---|---|---|---|---|
ΔvapH° | 59.29 | kJ/mol | N/A | Majer and Svoboda, 1985 | |
ΔvapH° | 59.29 ± 0.42 | kJ/mol | V | Mansson and Sunner, 1962 | hf298_H2SO4.115=-212.24 kcal/mol; ALS |
ΔvapH° | 59.3 | kJ/mol | N/A | Mansson and Sunner, 1962 | DRB |
ΔvapH° | 59.3 | kJ/mol | N/A | Mansson and Sunner, 1962 | AC |
Reduced pressure boiling point
Tboil (K) | Pressure (bar) | Reference | Comment |
---|---|---|---|
380.7 | 0.020 | Aldrich Chemical Company Inc., 1990 | BS |
Enthalpy of vaporization
ΔvapH (kJ/mol) | Temperature (K) | Method | Reference | Comment |
---|---|---|---|---|
51.6 | 378. | A | Stephenson and Malanowski, 1987 | Based on data from 363. to 491. K. See also Dykyj, Svoboda, et al., 1999.; AC |

References

Mansson and Sunner, 1962
Mansson, M.; Sunner, S.,
Heats of combustion and formation of the n-Alkane-αω-dithiols from ethane through pentane,
Acta Chem. Scand., 1962, 16, 1863-1869. [all data]
Majer and Svoboda, 1985
Majer, V.; Svoboda, V.,
Enthalpies of Vaporization of Organic Compounds: A Critical Review and Data Compilation, Blackwell Scientific Publications, Oxford, 1985, 300. [all data]
Aldrich Chemical Company Inc., 1990
Aldrich Chemical Company Inc.,
Catalog Handbook of Fine Chemicals, Aldrich Chemical Company, Inc., Milwaukee WI, 1990, 1. [all data]
Stephenson and Malanowski, 1987
Stephenson, Richard M.; Malanowski, Stanislaw,
Handbook of the Thermodynamics of Organic Compounds, 1987, https://doi.org/10.1007/978-94-009-3173-2
. [all data]
Dykyj, Svoboda, et al., 1999
Dykyj, J.; Svoboda, J.; Wilhoit, R.C.; Frenkel, M.L.; Hall, K.R.,
Vapor Pressure of Chemicals: Part A. Vapor Pressure and Antoine Constants for Hydrocarbons and Sulfur, Selenium, Tellurium and Hydrogen Containing Organic Compounds, Springer, Berlin, 1999, 373. [all data]