3-Hexen-1-ol, (Z)-
- Formula: C6H12O
- Molecular weight: 100.1589
- IUPAC Standard InChIKey: UFLHIIWVXFIJGU-ARJAWSKDSA-N
- CAS Registry Number: 928-96-1
- Chemical structure:
View 3d structure (requires JavaScript / HTML 5) - Species with the same structure:
- Isotopologues:
- Stereoisomers:
- Other names: (Z)-Hex-3-en-1-ol; cis-3-Hexen-1-ol; cis-3-Hexene-1-ol; cis-3-Hexenol; Blatteralkohol (German); Leaf alcohol; Z-3-Hexenol; 3-(Z)-Hexenol; Blatteralkohol; 3-Hexen-1-ol, cis-; 3-Hexenol, cis-; 3-(Z)-Hexen-1-ol; c-3-Hexen-1-ol; cis-Hex-3-en-1ol; cis-Hex-3-enol; Hex-3( Z)-en-1-ol; Hex-3(Z)-enol; (Z)-Hex-3-ene-1-ol; (Z)Hex-3-enol; (Z)-3-Hexen-1-ol; 3-Hexen-1-ol, (3Z)-; β,γ-Hexenol; HEXEN-30L-1; 3-Hexen-1-ol; (3Z)-3-Hexen-1-ol; cis-3-1-Hexenol

Phase change data

Data compiled by: Robert L. Brown and Stephen E. Stein
Quantity | Value | Units | Method | Reference | Comment |
---|---|---|---|---|---|
Tboil | 429. to 430. | K | N/A | Farchan Laboratories, 1990 | |
Tboil | 429.7 | K | N/A | Weast and Grasselli, 1989 |

Normal alkane RI, polar column, custom temperature program

Data compiled by: NIST Mass Spectrometry Data Center, William E. Wallace, director

Column type CapillaryCapillaryCapillaryCapillaryCapillary
Active phase SOLGel-WaxSOLGel-WaxHP InnowaxDB-WaxDB-Wax
Column length (m) 30.30.30.30.30.
Carrier gas HeliumHeliumNitrogenHydrogen
Substrate
Column diameter (mm) 0.250.250.250.250.32
Phase thickness (μm) 0.250.250.250.250.50
Program 40 0C (2 min) 5 0C/min -> 140 0C 10 0C/min -> 250 0C (3 min)not specified35 0C (10 min) 3 0C/min -> 205 0C 10 0C/min -> 225 0C35 0C (9 min) 5 0C/min -> 80 0C 1 0C/min -> 100 0C 16 0C/min -> 210 0C (20 min)40 0C (5 min) 4 0C/min -> 100 0C 6 0C/min -> 220 0C (40 min)
I 1389.1388.1370.1388.1394.
ReferenceJohanningsmeier and McFeeters, 2011Johanningsmeier and McFeeters, 2011Laribi, Kouki, et al., 2011Sampaio, Garruti, et al., 2011Ferreira, Juan, et al., 2009
Comment MSDC-RI MSDC-RI MSDC-RI MSDC-RI MSDC-RI
Column type CapillaryCapillaryCapillaryCapillaryCapillary
Active phase DB-WaxCP-Wax 52 CBDB-WaxCP-Wax 52 CBDB-Wax
Column length (m) 60.60.30.50.30.
Carrier gas HeliumHeliumHeliumHeliumHelium
Substrate
Column diameter (mm) 0.250.250.250.250.32
Phase thickness (μm) 0.500.250.250.290.25
Program 40 0C (3 min) 10 0C/min -> 90 0C 2 0C/min -> 230 0C (37 min)45 0C (5 min) 3 0C/min -> 150 0C 10 0C/min -> 240 0Cnot specified33 0C (1 min) 2 0C/min -> 130 0C 10 0C/min -> 220 0C40 0C (4 min) 3 0C/min -> 50 0C 5 0C/min -> 120 0C 7 0C/min -> 175 0C 10 0C/min -> 230 0C (8 min)
I 1390.1381.1381.1366.1415.
ReferenceLoscos, Hernandez-Orte, et al., 2009Romeo, Verzera, et al., 2009Zhao, Xu, et al., 2009Kaack and Christensen, 2008Yongsheng, Hua, et al., 2008
Comment MSDC-RI MSDC-RI MSDC-RI MSDC-RI MSDC-RI
Column type CapillaryCapillaryCapillaryCapillaryCapillary
Active phase Supelcowax-10DB-Wax EtrHP-InnowaxHP-InnowaxDB-Wax
Column length (m) 30.60.30.30.30.
Carrier gas HeHeHeHeHydrogen
Substrate
Column diameter (mm) 0.250.250.250.250.32
Phase thickness (μm) 0.250.50.250.250.50
Program 40C(10min) => 2C/min => 200C(1min) => 2C/min => 250C (10min)40C(3min) => 10C/min => 90C => 2C/min => 230C (37min)30C(5min) => 7C/min => 100C(5min) => 1C/min => 130C => 10C/min => 195C(45min)30C(5min) => 7C/min => 100C(5min) => 1C/min => 130C => 10C/min => 195C(45min)60 0C (3 min) 2 0C/min -> 220 0C 3 0C/min -> 245 0C (20 min)
I 1379.1390.1378.1379.1377.
ReferenceBosch-Fuste, Riu-Aumatell, et al., 2007Loskos, Hernandez-Orte, et al., 2007Narain, Galvao, et al., 2007Narain, Galvao, et al., 2007Selli, 2007
Comment MSDC-RI MSDC-RI MSDC-RI MSDC-RI MSDC-RI
Column type CapillaryCapillaryCapillaryCapillaryCapillary
Active phase DB-WaxSupelcowax-10HP-InnowaxHP-Innowax FSCHP-Innowax FSC
Column length (m) 30.30.60.60.60.
Carrier gas HeHeNitrogenHeN2
Substrate
Column diameter (mm) 0.250.250.250.250.25
Phase thickness (μm) 0.250.250.250.250.25
Program 50 0C (2 min) 6 0C/min -> 150 0C 8 0C/min -> 230 0C (15 min)40C(3min) => 4C/min => 75C => 8C/min => 250C(5min)50 0C (4 min) -> 40 0C 4 0C/min -> 220 0C60(10min) => 4C/min => 220C(10min) => 1C/min => 240C60C(10min) => 4C/min => 220C => (10min) => 1C/min => 240C
I 1377.1392.1391.1391.1391.
ReferenceTian, Zhang, et al., 2007Vichi, Guadayol, et al., 2007Quijano and Pino, 2006Suleimenov Y.M., Atazhanova G.A., et al., 2006Tabanca, Demirci, et al., 2006
Comment MSDC-RI MSDC-RI MSDC-RI MSDC-RI MSDC-RI
Column type CapillaryCapillaryCapillaryCapillaryCapillary
Active phase DB-FFAPHP-Innowax FSCCarbowax 20MCarbowax 20MCarbowax 20M
Column length (m) 30.60.50.
Carrier gas  N2H2
Substrate
Column diameter (mm) 0.320.250.32
Phase thickness (μm) 0.250.250.5
Program 35C(2min) => 40C/min => 60C(2min) => 6C/min => 180C => 10C/min=230C(10min)60C(10min) => 4C/min => 220C (10min) => 1C/min => 240C25C(7min) => 0.8C/min => 33C => 2.4C/min => 80C => 3.7C/min => 155C (20min)not specifiednot specified
I 1389.1391.1387.1370.1378.
ReferenceBuettner and Mestres, 2005Demirci, Demirci, et al., 2005Dhifi, Angerosa, et al., 2005Editorial paper, 2005Editorial paper, 2005
Comment MSDC-RI MSDC-RI MSDC-RI MSDC-RI MSDC-RI
Column type CapillaryCapillaryCapillaryCapillaryCapillary
Active phase CP-Wax 52CBHP-Innowax FSCHP Innowax FSPInnowax FSCInnowax FSC
Column length (m)  60.60.60.60.
Carrier gas HydrogenHeN2HeHe
Substrate
Column diameter (mm)  0.250.250.250.25
Phase thickness (μm)  0.250.250.250.25
Program not specified60C(10min) => 4C/min => 220C(10min) => 1C/min => 240C60C(10min) => 4C/min => 220C(10min) => 1C/min => 240C60C(10min) => 4C/min => 220C(10min) => 1C/min => 240C60C(10min) => 4C/min => 220C(10min) => 1C/min => 240C
I 1378.1391.1391.1391.1391.
ReferenceJales, Maia, et al., 2005Viljoen, Subramoney, et al., 2005Altintas, Kose, et al., 2004Baser, Özek, et al., 2004Baser, Özek, et al., 2004
Comment MSDC-RI MSDC-RI MSDC-RI MSDC-RI MSDC-RI
Column type CapillaryCapillaryCapillaryCapillaryCapillary
Active phase HP-Innowax FSCDB-WaxBP-21Carbowax 20MHP-Innowax FSC
Column length (m) 60. 50. 60.
Carrier gas He He He
Substrate
Column diameter (mm) 0.25 0.22 0.25
Phase thickness (μm) 0.25 0.25 0.25
Program 60C (10min) => 4C/min => 220C (10min) => 1C/min => 240Cnot specified50C => 2.5C/min => 180C(2min) => 1C/min => 200C(10min)not specified60C (10min) => 4C/min => 220C (10min) => 1C/min => 240C
I 1391.1405.1382.1351.1391.
ReferenceDemirci and Baser, 2004Escudero, Gogorza, et al., 2004Salinas, Zalacain, et al., 2004Vinogradov, 2004Demirci, Baser, et al., 2003
Comment MSDC-RI MSDC-RI MSDC-RI MSDC-RI MSDC-RI
Column type CapillaryCapillaryCapillaryCapillaryCapillary
Active phase PEG-20MDB-WaxHP Innowax FSPHP Innowax FSPHP-Innowax
Column length (m) 30.30.60.60.60.
Carrier gas  HeHeHe
Substrate
Column diameter (mm) 0.250.320.250.250.25
Phase thickness (μm) 0.250.50.250.250.25
Program 50C(8min) => 4C/min => 110C => 16C/min => 200C60C(2min) => 2C/min => 220C => 3C/min => 245C(20min)60C(10min) => 4C/min => 220C (10min) => 1C/min => 240C60C(10min) => 4C/min => 220C (10min) => 1C/min => 240C60C(10min) => 4C/min => 220C(10min) => 1C/min => 240C
I 1370.1390.1391.1391.1391.
ReferenceGarruti, Franco, et al., 2003Selli, Cabaroglu, et al., 2003Tasdemir, Demirci, et al., 2003Tasdemir, Demirci, et al., 2003Viljoen, van Vuuren, et al., 2003
Comment MSDC-RI MSDC-RI MSDC-RI MSDC-RI MSDC-RI
Column type CapillaryCapillaryCapillaryCapillaryCapillary
Active phase HP-Innowax FSCSupelcowax-10TRWAXHP-InnowaxDB-Wax
Column length (m) 60.60.60.60.30.
Carrier gas N2HeHeHeHe
Substrate
Column diameter (mm) 0.250.250.250.250.25
Phase thickness (μm) 0.250.250.250.250.25
Program 60C(10min) => 4C/min => 220C(10min) => 1C/min => 240C40C(20min) => (1.5C/min) => 200C => (10C/min) => 250C(120min)not specified60 0C (10 min) 10 K/min -> 220 0C (10 min) 1K/min -> 240 0C25 0C (0.5 min) 50 K/min -> 50 0C 3.5 K/min -> 150 0C 7.5 K/min -> 240 0C
I 1391.1335.1408.1391.1351.
ReferenceHüsnü Can Baser, Demirci, et al., 2002Rogerson and de Freitas, 2002Torrens, 2002Baser, Demirci, et al., 2001Miranda, Nogueira, et al., 2001
Comment MSDC-RI MSDC-RI MSDC-RI MSDC-RI MSDC-RI
Column type CapillaryCapillaryCapillaryCapillaryCapillary
Active phase Innowax FSCInnowax FSCDB-WaxSupelcowax-10Innowax
Column length (m) 60.60.60.60.60.
Carrier gas HeHeHe
Substrate
Column diameter (mm) 0.250.250.320.250.25
Phase thickness (μm) 0.250.250.51.0.25
Program 60C(10min) => 4C/min => 220C(10min) => 1C/min => 240C60C(10 min) => 4C/min => 220C(10min) => 1C/min => 240C50C(6min) => 1C/min => 130C => 10C/min => 240C (15min)50 C(5min) => 3C/min => 200C(4min) => 3C/min => 250C60C(10min) => 4C/min => 220C(10min) => 1C/min => 240C
I 1391.1391.1416.1379.1391.
ReferenceSaglam, Gozler, et al., 2001Kirimer, Tabanca, et al., 2000Piveteau, le Guen, et al., 2000Ramalho, de Freitas, et al., 1999Baser, Kürkcüoglu, et al., 1998
Comment MSDC-RI MSDC-RI MSDC-RI MSDC-RI MSDC-RI
Column type CapillaryCapillaryCapillaryCapillaryCapillary
Active phase Supelcowax-10CP-Wax 52CBFFAPPEGDB-FFAP
Column length (m) 60.50.25.40.30.
Carrier gas HeHe Hydrogen
Substrate
Column diameter (mm) 0.530.250.320.1820.32
Phase thickness (μm) 1.0.20.30.300.25
Program 40C (2min) => 16C/min => 120C => 15C/min => 240C(3min)30C (1.5min) => 3C/min => 120C => 10C/min => 220C (3.5min)35C (2min) => 40C/min => 60C(1min) => 6C/min => 230C35 0C (5 min) 5 0C/min -> 100 0C 3 0C/min -> 200 0C (1 min) 20 0C/min -> 240 0C (2 min)35C (1min) => 40C/min => 60C (1min) => 6C/min => 250C (10min)
I 1387.1379.1380.1375.1378.
ReferenceForney and Jordan, 1998Jakobsen, Hansen, et al., 1998Reiners and Grosch, 1998Vas, Gal, et al., 1998Guth, 1997
Comment MSDC-RI MSDC-RI MSDC-RI MSDC-RI MSDC-RI
Column type CapillaryCapillaryCapillaryCapillaryCapillary
Active phase CP-Wax 52CBSupelcowax 10Supelcowax 10Supelcowax 10CP-Wax 52 CB
Column length (m) 25.60.60.60.30.
Carrier gas H2HeliumHeliumHeliumH2
Substrate
Column diameter (mm) 0.30.250.250.250.32
Phase thickness (μm) 1.20.250.250.25
Program 60C(3min) => 2C/min => 220C => 3C/min => 245C60 0C (10 min) 2 0C/min -> 80 0C 3 0C/min -> 100 0C 4 0C/min -> 220 0C (30 min)not specifiednot specified60 0C 2 0C/min -> 220 0C 3 0C/min -> 245 0C
I 1395.1372.1360.1378.1395.
ReferenceLópez-Tamames, Carro-Mariño, et al., 1997Castioni and Kapetanidis, 1996Castioni and Kapetanidis, 1996Castioni and Kapetanidis, 1996Carro Marino, López Tamames, et al., 1995
Comment MSDC-RI MSDC-RI MSDC-RI MSDC-RI MSDC-RI
Column type CapillaryCapillaryCapillaryCapillaryCapillary
Active phase CP-Wax 52CBSupelcowaxCP-Wax 52CBCP-Wax 52CBSupelcowax-10
Column length (m)  30.50.50.30.
Carrier gas
Substrate
Column diameter (mm)  0.250.320.320.25
Phase thickness (μm)   1.51.5
Program 40C => 2C/min => 150C => 10C/min => 250Cnot specified40C => 2C/min => 150C => 10C/min => 250C40C => 2C/min => 150C => 10C/min => 250Cnot specified
I 1361.1382.1364.1364.1379.
ReferenceLuning, Carey, et al., 1995Garneau, Bouhajib, et al., 1994Luning, de Rijk, et al., 1994Luning, de Rijk, et al., 1994Jean, Garneau, et al., 1993
Comment MSDC-RI MSDC-RI MSDC-RI MSDC-RI MSDC-RI
Column type CapillaryCapillaryCapillaryCapillaryCapillary
Active phase Supelcowax-10CP-Wax 52CBDB-WaxDB-WaxCarbowax 20M
Column length (m) 30.50.60.60.60.
Carrier gas     He
Substrate
Column diameter (mm) 0.530.320.320.320.25
Phase thickness (μm) 0.25
Program 80C(5min) => 5C/min => 155C => 4C/min => 240C(30min)not specifiednot specifiednot specifiednot specified
I 1391.1358.1378.1378.1369.
ReferenceMiranda-Lopez, Libbey, et al., 1992Vernin, 1991Binder, Flath, et al., 1989Binder and Flath, 1989Fagan, Kepner, et al., 1982
Comment MSDC-RI MSDC-RI MSDC-RI MSDC-RI MSDC-RI
Column type Capillary
Active phase Carbowax 20M
Column length (m) 60.
Carrier gas He
Substrate
Column diameter (mm) 0.25
Phase thickness (μm)
Program not specified
I 1375.
ReferenceFagan, Kepner, et al., 1982
Comment MSDC-RI

Kovats' RI, non-polar column, temperature ramp

Data compiled by: NIST Mass Spectrometry Data Center, William E. Wallace, director

Column type CapillaryCapillaryCapillaryCapillaryCapillary
Active phase HP-5MSCP Sil 8 CBHP-5MSBP-1BP-1
Column length (m) 60.30.30.60.25.
Carrier gas HeH2HeN2N2
Substrate
Column diameter (mm) 0.250.250.250.320.55
Phase thickness (μm) 0.250.250.250.250.25
Tstart (C) 40.50.50.60.60.
Tend (C) 250.220.250.220.220.
Heat rate (K/min) 3.3.3.5.5.
Initial hold (min) 1.2.10.
Final hold (min) 20. 5. 15.
I 855.854.858.846.849.
ReferenceJalali-Heravi, Zekavat, et al., 2006Tayoub, Schwob, et al., 2006Asuming, Beauchamp, et al., 2005Raina, Lal, et al., 2002Raina, Srivastava, et al., 2002
Comment MSDC-RI MSDC-RI MSDC-RI MSDC-RI MSDC-RI
Column type CapillaryCapillaryCapillaryCapillaryCapillary
Active phase BP-1BP-1SE-54DB-5CP Sil 5 CB
Column length (m) 30.25.30.30.25.
Carrier gas N2N2He He
Substrate
Column diameter (mm) 0.320.550.260.250.25
Phase thickness (μm) 0.250.250.250.25
Tstart (C) 60.60.60.50.60.
Tend (C) 220.220.246.235.280.
Heat rate (K/min) 5.5.3.15.5.
Initial hold (min)    2.
Final hold (min) 13.15. 2.
I 839.834.857.858.841.
ReferenceShawl, Srivastava, et al., 2002Jain, Aggarwal, et al., 2001Adams, 2000Dickens, 1999Kaul, Gujral, et al., 1999
Comment MSDC-RI MSDC-RI MSDC-RI MSDC-RI MSDC-RI
Column type CapillaryCapillaryCapillaryCapillaryCapillary
Active phase HP-5MSBP-1DB-5OV-101SPB-1
Column length (m) 30.25.30.25.50.
Carrier gas HeN2HeN2He
Substrate
Column diameter (mm) 0.320.250.250.250.20
Phase thickness (μm) 0.25 0.25
Tstart (C) 70.60.60.50.35.
Tend (C) 250.220.240.200.200.
Heat rate (K/min) 3.5.3.5.3.
Initial hold (min) 5.   5.
Final hold (min)     20.
I 851.831.857.847.847.
ReferenceSiani, Ramos, et al., 1999Kulkarni, Mallavarapu, et al., 1998Tellez, Estell, et al., 1997Menut, Molangui, et al., 1995Wong and Tie, 1993
Comment MSDC-RI MSDC-RI MSDC-RI MSDC-RI MSDC-RI
Column type CapillaryCapillaryCapillaryCapillaryCapillary
Active phase DB-1DB-1BP-1DB-1DB-1
Column length (m) 60.60.50.60.60.
Carrier gas HeHeHeHeHe
Substrate
Column diameter (mm) 0.320.320.230.250.25
Phase thickness (μm) 0.250.25 1.1.
Tstart (C) 30.30.30.40.40.
Tend (C) 210.210.200.250.250.
Heat rate (K/min) 2.2.2.12.4.
Initial hold (min) 4.4.2.4.
Final hold (min)
I 843.844.845.863.862.
ReferenceTakeoka, Flath, et al., 1990Takeoka, Flath, et al., 1990Bartley and Schwede, 1989Burns and Tingey, 1983Burns and Tingey, 1983
Comment MSDC-RI MSDC-RI MSDC-RI MSDC-RI MSDC-RI
Column type CapillaryCapillaryCapillaryCapillaryCapillary
Active phase SF96+IgepalOV-101OV-101OV-101OV-101
Column length (m) 127.70.70.70.70.
Carrier gas  N2N2N2N2
Substrate
Column diameter (mm) 0.750.280.280.280.28
Phase thickness (μm)
Tstart (C) 70.80.80.80.80.
Tend (C) 190.200.200.200.200.
Heat rate (K/min) 1.2.2.2.2.
Initial hold (min)
Final hold (min)
I 852.846.847.849.847.
ReferencePalma-Fleming and Kepner, 1983Yamaguchi and Shibamoto, 1981Yamaguchi and Shibamoto, 1981Yamaguchi and Shibamoto, 1979Yamaguchi and Shibamoto, 1979
Comment MSDC-RI MSDC-RI MSDC-RI MSDC-RI MSDC-RI

Normal alkane RI, polar column, isothermal

Data compiled by: NIST Mass Spectrometry Data Center, William E. Wallace, director

Column type Packed
Active phase Carbowax 20M
Column length (m)
Carrier gas
Substrate
Column diameter (mm)
Phase thickness (μm)
Temperature (C) 100.
I 1369.
ReferenceYabumoto, Jennings, et al., 1977
Comment MSDC-RI

Van Den Dool and Kratz RI, polar column, temperature ramp

Data compiled by: NIST Mass Spectrometry Data Center, William E. Wallace, director

Column type CapillaryCapillaryCapillaryCapillaryCapillary
Active phase DB-Wax EtrDB-WaxInnowaxHP-20MDB-Wax
Column length (m) 30.30.30.50.30.
Carrier gas  HeH2HeHe
Substrate
Column diameter (mm) 0.250.250.250.20.25
Phase thickness (μm) 0.250.250.250.20.5
Tstart (C) 40.50.45.70.40.
Tend (C) 250.180.210.180.250.
Heat rate (K/min) 5.3.53.54.4.
Initial hold (min) 3.2.5.4.5.
Final hold (min) 15.25.20.15.15.
I 1386.1383.1401.1351.1394.
ReferenceAubert and Chanforan, 2007Botelho, Caldeira, et al., 2007Botelho, Caldeira, et al., 2007Politeo, Jukic, et al., 2007Pozo-Bayon M.A., Ruiz-Rodriguez A., et al., 2007
Comment MSDC-RI MSDC-RI MSDC-RI MSDC-RI MSDC-RI
Column type CapillaryCapillaryCapillaryCapillaryCapillary
Active phase DB-WaxHP-InnowaxDB-Wax EtrInnowaxDB-Wax
Column length (m) 30.60.30.60.30.
Carrier gas HeHeHeHeHe
Substrate
Column diameter (mm) 0.250.250.250.250.25
Phase thickness (μm) 0.50.250.250.250.25
Tstart (C) 40.50.40.40.50.
Tend (C) 250.220.250.230.220.
Heat rate (K/min) 4.4.5.4.4.
Initial hold (min) 5.4.3.4.4.
Final hold (min) 15.10.15.20.20.
I 1394.1363.1387.1384.1373.
ReferencePozo-Bayon M.A., Ruiz-Rodriguez A., et al., 2007Quijano, Linares, et al., 2007Aubert C. and Pitrat M., 2006Lee, Lee, et al., 2006Osorio, Alarcon, et al., 2006
Comment MSDC-RI MSDC-RI MSDC-RI MSDC-RI MSDC-RI
Column type CapillaryCapillaryCapillaryCapillaryCapillary
Active phase DB-WaxStabilwaxBP-20DB-WaxInnowax
Column length (m) 30.30.50.30.50.
Carrier gas  N2HeHeHe
Substrate
Column diameter (mm) 0.320.320.220.250.25
Phase thickness (μm) 0.51.0.250.250.25
Tstart (C) 40.40.60.40.50.
Tend (C) 200.230.220.250.220.
Heat rate (K/min) 5.4.2.3.2.
Initial hold (min) 3.2.  3.
Final hold (min) 8.10.20.20.20.
I 1397.1390.1382.1373.1394.
ReferencePetka, Ferreira, et al., 2006Fang and Qian, 2005Ferrari, Tomi, et al., 2005Gancel, Ollitrault, et al., 2005Lee, Lee, et al., 2005
Comment MSDC-RI MSDC-RI MSDC-RI MSDC-RI MSDC-RI
Column type CapillaryCapillaryCapillaryCapillaryCapillary
Active phase RTX-WaxSupelcowax-10DB-WaxCarbowax 20MDB-Wax
Column length (m) 60.30.30.60.30.
Carrier gas HeHeHeHeH2
Substrate
Column diameter (mm) 0.220.250.250.250.25
Phase thickness (μm) 0.250.250.250.250.25
Tstart (C) 60.60.40.45.40.
Tend (C) 230.240.200.250.250.
Heat rate (K/min) 2.3.2.2.3.
Initial hold (min)  5. 0.173.
Final hold (min) 35.10.20. 20.
I 1377.1382.1372.1370.1374.
ReferencePaolini, Costa, et al., 2005Riu-Aumatell, Lopez-Tamames, et al., 2005Seo and Baek, 2005Verzera, Campisi, et al., 2005Aubert and Bourger, 2004
Comment MSDC-RI MSDC-RI MSDC-RI MSDC-RI MSDC-RI
Column type CapillaryCapillaryCapillaryCapillaryCapillary
Active phase CP-Wax 52CBZB-WaxDB-Wax EtrDB-WaxDB-Wax
Column length (m) 30.30.30.30.30.
Carrier gas HeHeHeHeHe
Substrate
Column diameter (mm) 0.250.250.250.250.25
Phase thickness (μm) 0.20.150.250.250.25
Tstart (C) 80.35.40.40.40.
Tend (C) 240.220.245.240.240.
Heat rate (K/min) 10.1.83.6.6.
Initial hold (min) 4.10.3.10.10.
Final hold (min)  10.20.25.25.
I 1377.1381.1372.1371.1372.
ReferenceFerrari, Lablanquie, et al., 2004Ledauphin, Saint-Clair, et al., 2004Ménager, Jost, et al., 2004Varming, Andersen, et al., 2004Varming, Petersen, et al., 2004
Comment MSDC-RI MSDC-RI MSDC-RI MSDC-RI MSDC-RI
Column type CapillaryCapillaryCapillaryCapillaryCapillary
Active phase DB-WaxDB-WaxDB-WaxDB-WaxSupelcowax
Column length (m) 30.30.30.30.25.
Carrier gas HeHe
Substrate
Column diameter (mm) 0.250.250.320.320.25
Phase thickness (μm) 0.250.250.50.50.25
Tstart (C) 40.40.40.40.35.
Tend (C) 200.200.245.245.225.
Heat rate (K/min) 4.4.3.2.4.
Initial hold (min) 5.5.3.3.5.
Final hold (min) 20.20.20.20.10.
I 1373.1380.1387.1383.1391.
ReferenceYu, Kim, et al., 2004Zheng, Kim, et al., 2004Aubert, Ambid, et al., 2003Aubert, Günata, et al., 2003Chisholm, Wilson, et al., 2003
Comment MSDC-RI MSDC-RI MSDC-RI MSDC-RI MSDC-RI
Column type CapillaryCapillaryCapillaryCapillaryCapillary
Active phase DB-WaxDB-WaxAT-WaxDB-WaxDB-Wax
Column length (m) 60.60.60.30.60.
Carrier gas H2HeHe He
Substrate
Column diameter (mm) 0.320.250.320.320.32
Phase thickness (μm) 0.25 0.250.50.5
Tstart (C) 40.40.65.35.67.
Tend (C) 245.220.250.240.235.
Heat rate (K/min) 1.53.2.5.2.7
Initial hold (min)  10.10.5.
Final hold (min) 20.30.60.5.30.
I 1373.1380.1370.1382.1426.
ReferenceGancel, Ollitrault, et al., 2003Hayata, Sakamoto, et al., 2003Pino, Almora, et al., 2003Rega, Fournier, et al., 2003Claudela, Dirningera, et al., 2002
Comment MSDC-RI MSDC-RI MSDC-RI MSDC-RI MSDC-RI
Column type CapillaryCapillaryCapillaryCapillaryCapillary
Active phase AT-WaxDB-WaxAT-WaxAT-WaxDB-Wax
Column length (m) 60.30.60.60.30.
Carrier gas HeH2HeHeHe
Substrate
Column diameter (mm) 0.320.320.320.320.32
Phase thickness (μm) 0.250.250.250.250.5
Tstart (C) 65.35.65.65.50.
Tend (C) 250.220.250.250.250.
Heat rate (K/min) 2.4.2.2.8.
Initial hold (min) 10.0.510.10.
Final hold (min) 60. 60.60.
I 1368.1397.81367.1368.1387.
ReferencePino, Marbot, et al., 2002Pet'ka, Mocák, et al., 2001Pino and Marbot, 2001Pino, Marbot, et al., 2001Serot, Prost, et al., 2001
Comment MSDC-RI MSDC-RI MSDC-RI MSDC-RI MSDC-RI
Column type CapillaryCapillaryCapillaryCapillaryCapillary
Active phase DB-WaxCP-Wax 52CBDB-WaxDB-WaxDB-Wax
Column length (m) 30.60.30.60.60.
Carrier gas HeHeHeHeHe
Substrate
Column diameter (mm) 0.320.250.320.320.53
Phase thickness (μm) 0.50.250.50.51.0
Tstart (C) 35.45.60.30.50.
Tend (C) 250.250.245.160.220.
Heat rate (K/min) 1.12.3.3.3.
Initial hold (min)  0.173.
Final hold (min) 10. 20.5.
I 1397.81370.1383.1422.1350.
ReferenceSiegmund, Derler, et al., 2001Verzera, Campisi, et al., 2001Wirth, Guo, et al., 2001Beauchene, Grua-Priol, et al., 2000Brophy, Goldsack, et al., 2000
Comment MSDC-RI MSDC-RI MSDC-RI MSDC-RI MSDC-RI
Column type CapillaryCapillaryCapillaryCapillaryCapillary
Active phase DB-WaxDB-WaxDB-WaxCP-Wax 52CBDB-Wax
Column length (m) 30.30.60.50.30.
Carrier gas He HeHeHe
Substrate
Column diameter (mm) 0.320.320.320.250.25
Phase thickness (μm) 0.50.50.50.20.25
Tstart (C) 60.60.40.30.40.
Tend (C) 245.245.250.220.200.
Heat rate (K/min) 3.3.3.2.2.
Initial hold (min) 3.3.5.1.35.
Final hold (min) 20.20.10. 20.
I 1386.1386.1391.1366.1382.
ReferenceBureau, Baumes, et al., 2000Bureau, Razungles, et al., 2000le Guen, Prost, et al., 2000Jensen, Christensen, et al., 2000Kim, Thuy, et al., 2000
Comment MSDC-RI MSDC-RI MSDC-RI MSDC-RI MSDC-RI
Column type CapillaryCapillaryCapillaryCapillaryCapillary
Active phase DB-WaxHP-20MHP-20MDB-WaxDB-Wax
Column length (m) 30.50.50.30.30.
Carrier gas HeHeHe H2
Substrate
Column diameter (mm) 0.250.20.20.320.25
Phase thickness (μm) 0.250.20.20.250.25
Tstart (C) 40.70.70.40.60.
Tend (C) 200.180.180.230.220.
Heat rate (K/min) 2.4.4.3.2.
Initial hold (min) 5.4.4.4.3.
Final hold (min) 20.10.10.
I 1384.1350.1346.1378.1384.
ReferenceKim, Thuy, et al., 2000Milos, Mastelic, et al., 2000Milos and Radonic, 2000Ruther, 2000Chassagne, Boulanger, et al., 1999
Comment MSDC-RI MSDC-RI MSDC-RI MSDC-RI MSDC-RI
Column type CapillaryCapillaryCapillaryCapillaryCapillary
Active phase HP-InnowaxDB-WaxDB-WaxHP-WaxDB-Wax
Column length (m) 60.60.30.50.60.
Carrier gas He  HeHe
Substrate
Column diameter (mm) 0.250.250.320.20.25
Phase thickness (μm)  0.250.50.40.25
Tstart (C) 32.40.40.30.50.
Tend (C) 220.200.245.220.230.
Heat rate (K/min) 2.3.3.5.3.
Initial hold (min) 1.5.3.1.
Final hold (min) 40.60.20.30.
I 1393.1381.1357.1396.1388.
ReferenceChristensen, Jakobsen, et al., 1999Cha, Kim, et al., 1998Ollé, Baumes, et al., 1998Christensen, Jakobsen, et al., 1997Shimoda, Wu, et al., 1996
Comment MSDC-RI MSDC-RI MSDC-RI MSDC-RI MSDC-RI
Column type CapillaryCapillaryCapillaryCapillaryCapillary
Active phase DB-WaxDB-WaxCarbowax 20MDB-WaxDB-Wax
Column length (m) 30.30.60.60.30.
Carrier gas HeHeHe He
Substrate
Column diameter (mm) 0.320.320.320.250.25
Phase thickness (μm) 0.50.50.4250.25
Tstart (C) 50.50.45.50.40.
Tend (C) 230.230.300.230.200.
Heat rate (K/min) 2.2.3.2.2.
Initial hold (min)   3. 5.
Final hold (min)   20.
I 1396.1395.1370.1383.1387.
ReferenceCoen, Engel, et al., 1995Coen, Engel, et al., 1995Mondello, Dugo, et al., 1995Shimoda, Shigematsu, et al., 1995Iwaoka, Hagi, et al., 1994
Comment MSDC-RI MSDC-RI MSDC-RI MSDC-RI MSDC-RI
Column type CapillaryCapillaryCapillaryCapillaryCapillary
Active phase DB-WaxHP-20MHP-FFAPDB-WaxDB-Wax
Column length (m) 60.50.50.30.30.
Carrier gas HeHeHeHeHe
Substrate
Column diameter (mm) 0.250.250.250.250.25
Phase thickness (μm)     0.25
Tstart (C) 40.60.60.40.50.
Tend (C) 200.190.210.200.220.
Heat rate (K/min) 3.3.3.2.4.
Initial hold (min) 5.  10.3.
Final hold (min)     20.
I 1389.1357.1400.1382.1370.
ReferenceSumitani, Suekane, et al., 1994Chung, Eiserich, et al., 1993Chung, Eiserich, et al., 1993Umano, Hagi, et al., 1992Humpf and Schreier, 1991
Comment MSDC-RI MSDC-RI MSDC-RI MSDC-RI MSDC-RI
Column type CapillaryCapillaryCapillaryCapillaryCapillary
Active phase CP-Wax 58CBCarbowax 20MCarbowax 20MDB-WaxDB-Wax
Column length (m) 30.25.25.30.30.
Carrier gas He  HeHe
Substrate
Column diameter (mm) 0.250.310.310.320.25
Phase thickness (μm) 0.22  0.250.25
Tstart (C) 40.50.50.40.50.
Tend (C) 220.200.200.220.250.
Heat rate (K/min) 3.2.2.5.4.
Initial hold (min)    3.3.
Final hold (min)
I 1364.1351.1360.1387.1387.
ReferencePabst, Barron, et al., 1991Suárez and Duque, 1991Suárez and Duque, 1991Frohlich and Schreier, 1990Fröhlich, Duque, et al., 1989
Comment MSDC-RI MSDC-RI MSDC-RI MSDC-RI MSDC-RI
Column type CapillaryCapillaryCapillary
Active phase DB-WaxCarbowax 20MOV-351
Column length (m) 30.50.25.
Carrier gas HeH2N2
Substrate
Column diameter (mm) 0.250.20.32
Phase thickness (μm) 0.25
Tstart (C) 50.50.50.
Tend (C) 250.200.
Heat rate (K/min) 4.2.6.
Initial hold (min) 3.
Final hold (min)  55.
I 1391.1362.1359.
ReferenceFröhlich, Duque, et al., 1989Wu and Liou, 1986Korhonen, 1984
Comment MSDC-RI MSDC-RI MSDC-RI

Van Den Dool and Kratz RI, polar column, custom temperature program

Data compiled by: NIST Mass Spectrometry Data Center, William E. Wallace, director

Column type CapillaryCapillaryCapillaryCapillaryCapillary
Active phase Supelcowax-10DB-WaxFFAPDB-WaxDB-Wax
Column length (m) 30.30.30.30.30.
Carrier gas HeH2 H2H2
Substrate
Column diameter (mm) 0.250.320.320.320.32
Phase thickness (μm) 0.250.50.250.50.5
Program 35C(8min) => 4C/min => 60C => 6C/min => 160C => 20C/min => 200C(1min)40C(5min) => 4C/min => 100C6C/min => 136C => 3C/min => 220C (10min)40C(2min) => 6C/min => 150C => 20C/min => 230C60C(3min) => 2C/min => 220C => 3C/min => 245C (20min)60C(3min) => 2C/min => 220C => 3C/min => 245C(20min)
I 1388.1398.1381.1387.1387.
ReferenceBianchi, Careri, et al., 2007Escudero, Campo, et al., 2007Schuh and Schieberle, 2006Selli, Canbas, et al., 2006Selli, Canbas, et al., 2006, 2
Comment MSDC-RI MSDC-RI MSDC-RI MSDC-RI MSDC-RI
Column type CapillaryCapillaryCapillaryCapillaryCapillary
Active phase SOLGel-WaxSOLGel-WaxSOLGel-WaxSOLGel-WaxSOLGel-Wax
Column length (m) 30.30.30.30.30.
Carrier gas HeHeHeHeHe
Substrate
Column diameter (mm) 0.250.250.250.250.25
Phase thickness (μm) 0.250.250.250.250.25
Program 35C(5min) => 3C/min => 150C => 5C/min => 250C(10 min)35C(5min) => 3C/min => 150C => 5C/min => 250C (10min)35C(5min) => 3C/min => 150C => 5C/min => 250C (10min)35C(5min) => 3C/min => 150C => 5C/min => 250C (10min)35C(5min) => 3C/min => 150C => 5C/min => 250C (10min)
I 1366.1366.1366.1366.1366.
ReferenceAubert, Baumann, et al., 2005Aubert, Baumann, et al., 2005Aubert, Baumann, et al., 2005Aubert, Baumann, et al., 2005Aubert, Baumann, et al., 2005
Comment MSDC-RI MSDC-RI MSDC-RI MSDC-RI MSDC-RI
Column type CapillaryCapillaryCapillaryCapillaryCapillary
Active phase DB-WaxSupelcowax-10CP-Wax 52CBDB-WaxDB-Wax
Column length (m) 30.30.50.30.60.
Carrier gas H2HeHeHeHe
Substrate
Column diameter (mm) 0.320.250.250.250.25
Phase thickness (μm) 0.50.250.20.250.25
Program 40C(5min) => 4C/min => 100C => 6C/min => 200C35C(8min) => 3C/min => 134C => 20C/min => 250C(3.2min)33C(1.5min) => 1.5C/min => 60C(4min) => 2C/min => 100C => 8C/min => 220C(15min)40 (5min) => 4C/min => 140C => 4C/min => 200C (20min)35C(0.7min) => 20C/min => 70C => 4C/min => 240C
I 1398.1384.1366.1375.1371.
ReferenceCampo, Ferreira, et al., 2005Howard, Mike, et al., 2005Kaack, Christensen, et al., 2005Zheng, Kim, et al., 2005Ferrari, Lablanquie, et al., 2004
Comment MSDC-RI MSDC-RI MSDC-RI MSDC-RI MSDC-RI
Column type CapillaryCapillaryCapillaryCapillaryCapillary
Active phase StabilwaxDB-WaxCarbowax 20MDB-WaxSupelcowax-10
Column length (m) 30.30.25.30.30.
Carrier gas HeH2H2He
Substrate
Column diameter (mm) 0.320.320.320.250.32
Phase thickness (μm) 1.0.50.250.50.3
Program 40C (2min) => 5C/min => 100C => 4C/min => 230C (10min)60C(3min) => 2C/min => 220C => 3C/min => 245C (20min)40C (8min) => 3C/min => 180C => 20C/min => 230C40C(2min) => 2C/min => 100C => 10C/min => 230C (5min)60C(8min) => 8C/min => 170C => 13C/min => 240C(20min)
I 1406.1387.1382.1397.1381.
ReferenceKlesk, Qian, et al., 2004Selli, Cabaroglu, et al., 2004Boido, Lloret, et al., 2003Klesk and Qian, 2003da Porto, Pizzale, et al., 2003
Comment MSDC-RI MSDC-RI MSDC-RI MSDC-RI MSDC-RI
Column type CapillaryCapillaryCapillaryCapillaryCapillary
Active phase HP-InnowaxDB-WaxDB-WaxDB-WaxDB-Wax
Column length (m) 30.30.30.30.30.
Carrier gas HeH2H2 H2
Substrate
Column diameter (mm) 0.320.250.250.250.25
Phase thickness (μm) 0.50.250.250.250.25
Program 40C(4min) => 10C/min => 70C => 5C/min => 150C => 10C/min => 250C (10min)60C (3min) => 2C/min => 220C => 5C/min => 250C (15min)60C (3min) => 2C/min => 220C => 5C/min => 250C (15min)30C(8min) => 4C/min => 60C => 6C/min => 160C => 20C/min => 200C(1min)60 0C (3 min) 2 K/min -> 220 0C 5 K/min -> 250 0C (15 min)
I 1394.1387.1390.1417.1359.
ReferenceKoprivnjak, Conte, et al., 2002Boulanger and Crouzet, 2001Boulanger and Crouzet, 2001Radovic, Careri, et al., 2001Boulanger and Crouzet, 2000
Comment MSDC-RI MSDC-RI MSDC-RI MSDC-RI MSDC-RI
Column type CapillaryCapillaryCapillary
Active phase DB-WaxHP-InnowaxFFAP
Column length (m) 30.30.30.
Carrier gas H2HeHe
Substrate
Column diameter (mm) 0.250.250.32
Phase thickness (μm) 0.250.250.25
Program 60C(3min) => 2C/min => 220C => 5C/min => 250C (15min)60C(8min) => 3C/min => 180C(5min) => 40C/min => 250C35C(2min) => 40C/min => 60C(2min) => 6C/min => 180C => 10C/min => 230C(10 min)
I 1372.1390.1389.
ReferenceBoulanger and Crouzet, 2000, 2Bisio, Ciarallo, et al., 1998Hinterholzer, Lemos, et al., 1998
Comment MSDC-RI MSDC-RI MSDC-RI

References

Farchan Laboratories, 1990
Farchan Laboratories,
Research Chemicals Catalog, Farchan Laboratories, Gainesville, FL, 1990, 91. [all data]
Weast and Grasselli, 1989
CRC Handbook of Data on Organic Compounds, 2nd Editon, Weast,R.C and Grasselli, J.G., ed(s)., CRC Press, Inc., Boca Raton, FL, 1989, 1. [all data]