5-Hexyn-1-ol
- Formula: C6H10O
- Molecular weight: 98.1430
- IUPAC Standard InChIKey: GOQJMMHTSOQIEI-UHFFFAOYSA-N
- CAS Registry Number: 928-90-5
- Chemical structure:
View 3d structure (requires JavaScript / HTML 5) - Other names: 1-Hydroxy-5-hexyne; 6-Hydroxy-1-hexyne; Hex-5-yn-1-ol

Phase change data

Data compiled by: Robert L. Brown and Stephen E. Stein
Reduced pressure boiling point
Tboil (K) | Pressure (bar) | Reference |
---|---|---|
347.2 | 0.020 | Aldrich Chemical Company Inc., 1990 |
348. | 0.021 | Farchan Laboratories, 1990 |
348.2 | 0.021 | Weast and Grasselli, 1989 |

References

Aldrich Chemical Company Inc., 1990
Aldrich Chemical Company Inc.,
Catalog Handbook of Fine Chemicals, Aldrich Chemical Company, Inc., Milwaukee WI, 1990, 1. [all data]
Farchan Laboratories, 1990
Farchan Laboratories,
Research Chemicals Catalog, Farchan Laboratories, Gainesville, FL, 1990, 91. [all data]
Weast and Grasselli, 1989
CRC Handbook of Data on Organic Compounds, 2nd Editon, Weast,R.C and Grasselli, J.G., ed(s)., CRC Press, Inc., Boca Raton, FL, 1989, 1. [all data]