2-Heptanone, 6-methyl-
- Formula: C8H16O
- Molecular weight: 128.2120
- IUPAC Standard InChIKey: DPLGXGDPPMLJHN-UHFFFAOYSA-N
- CAS Registry Number: 928-68-7
- Chemical structure:
View 3d structure (requires JavaScript / HTML 5) - Other names: 2-Methyl-6-heptanone; 6-Methyl-2-heptanone; Methyl isohexyl ketone; 6-Methylheptan-2-one

Phase change data

Data compiled by: Thermodynamics Research Center, NIST Boulder Laboratories, Chris Muzny director
Quantity | Value | Units | Method | Reference | Comment |
---|---|---|---|---|---|
Tboil | 444. | K | N/A | Price and Meisel, 1947 | Uncertainty assigned by TRC = 3. K |
Tboil | 444. | K | N/A | Guerbet, 1912 | Uncertainty assigned by TRC = 3. K |
Tboil | 438. | K | N/A | Wallach, 1911 | Uncertainty assigned by TRC = 3. K |

Normal alkane RI, non-polar column, temperature ramp

Data compiled by: NIST Mass Spectrometry Data Center, William E. Wallace, director

Column type CapillaryCapillaryCapillaryCapillaryCapillary
Active phase Optima-5 MSHP-5 MSSPB-5Ultra-2BPX-5
Column length (m) 30.30.60.50.25.
Carrier gas HeliumHelium HeHe
Substrate
Column diameter (mm) 0.250.320.320.250.22
Phase thickness (μm) 0.250.501.0.320.25
Tstart (C) 35.50.40.50.50.
Tend (C) 250.250.230.270.320.
Heat rate (K/min) 10.5.3.2.5.
Initial hold (min) 3. 5. 5.
Final hold (min) 5.5.5.
I 954.957.955.954.965.
ReferenceGoeminne, Vandendriessche, et al., 2012Sylla, Berge, et al., 2009Vasta, Ratel, et al., 2007Schlumpberger B.O., Clery R.A., et al., 2006Dickschat, Martens, et al., 2005
Comment MSDC-RI MSDC-RI MSDC-RI MSDC-RI MSDC-RI

Kovats' RI, non-polar column, isothermal

Data compiled by: NIST Mass Spectrometry Data Center, William E. Wallace, director

Column type Capillary
Active phase OV-101
Column length (m) 50.
Carrier gas N2
Substrate
Column diameter (mm) 0.26
Phase thickness (μm)
Temperature (C) 170.
I 947.
ReferenceGribanova, Kharitonov, et al., 1990
Comment MSDC-RI

Van Den Dool and Kratz RI, polar column, custom temperature program

Data compiled by: NIST Mass Spectrometry Data Center, William E. Wallace, director

Column type Capillary
Active phase Carbowax 20M
Column length (m) 150.
Carrier gas
Substrate
Column diameter (mm) 0.75
Phase thickness (μm)
Program not specified
I 1236.
ReferenceWhitfield, Shea, et al., 1981
Comment MSDC-RI

Normal alkane RI, polar column, custom temperature program

Data compiled by: NIST Mass Spectrometry Data Center, William E. Wallace, director

Column type CapillaryCapillaryCapillary
Active phase Innowax FSCInnowax FSCInnowax FSC
Column length (m) 60.60.60.
Carrier gas HeliumHeHe
Substrate
Column diameter (mm) 0.250.250.25
Phase thickness (μm) 0.250.250.25
Program 60 0C (10 min) 4 0C/min -> 220 0C (10 min) 1 0C/min -> 240 0C60C(10min) => 4C/min >220C (10min) => 1C/min => 240C60C(10min) => 4C/min >220C (10min) => 1C/min => 240C
I 1247.1247.1247.
ReferenceBaser, Demirci, et al., 2009Baser, Özek, et al., 2006Baser, Özek, et al., 2006
Comment MSDC-RI MSDC-RI MSDC-RI

Kovats' RI, non-polar column, temperature ramp

Data compiled by: NIST Mass Spectrometry Data Center, William E. Wallace, director

Column type CapillaryCapillary
Active phase OV-101OV-101
Column length (m) 50.50.
Carrier gas
Substrate
Column diameter (mm) 0.230.23
Phase thickness (μm)
Tstart (C) 80.80.
Tend (C) 200.200.
Heat rate (K/min) 2.2.
Initial hold (min)
Final hold (min)
I 957.957.
ReferenceOhnishi and Shibamoto, 1984Ohnishi and Shibamoto, 1984
Comment MSDC-RI MSDC-RI

References

Price and Meisel, 1947
Price, C.C.; Meisel, S.L.,
An Isomer of Citronellal,
J. Am. Chem. Soc., 1947, 69, 1497. [all data]
Guerbet, 1912
Guerbet, M.,
C. R. Hebd. Seances Acad. Sci., 1912, 154, 1357. [all data]
Wallach, 1911
Wallach, O.,
Justus Liebigs Ann. Chem., 1911, 381, 51. [all data]