4-Chloro-1-butanol
- Formula: C4H9ClO
- Molecular weight: 108.567
- IUPAC Standard InChIKey: HXHGULXINZUGJX-UHFFFAOYSA-N
- CAS Registry Number: 928-51-8
- Chemical structure:
View 3d structure (requires JavaScript / HTML 5) - Other names: 1-Butanol, 4-chloro-; Tetramethylene chlorohydrin; 4-Chloro-1-butane-ol; 4-Chlorobutanol; 4-Chlorbutan-1-ol; 4-chlorobutan-1-ol

Phase change data

Data compiled by: Robert L. Brown and Stephen E. Stein
Reduced pressure boiling point
Tboil (K) | Pressure (bar) | Reference |
---|---|---|
357.7 | 0.021 | Weast and Grasselli, 1989 |
359. to 362. | 0.027 | Frinton Laboratories Inc., 1986 |

References

Weast and Grasselli, 1989
CRC Handbook of Data on Organic Compounds, 2nd Editon, Weast,R.C and Grasselli, J.G., ed(s)., CRC Press, Inc., Boca Raton, FL, 1989, 1. [all data]
Frinton Laboratories Inc., 1986
Frinton Laboratories Inc.,
Catalog Number 11, Frinton Laboratories Inc., Vineland, NJ, 1986, 99. [all data]