Ethanethioic acid, S-butyl ester
- Formula: C6H12OS
- Molecular weight: 132.224
- IUPAC Standard InChIKey: XBHDWERUSGIZNS-UHFFFAOYSA-N
- CAS Registry Number: 928-47-2
- Chemical structure:
View 3d structure (requires JavaScript / HTML 5) - Other names: Acetic acid, thio-, S-butyl ester; S-Butyl thioacetate; CH3C(O)S(CH2)3CH3; S-n-Butylthioacetate; Butyl thioacetate; Butyl thiolacetate

Phase change data

Data compiled as indicated in comments:
AC - William E. Acree, Jr., James S. Chickos
ALS - Hussein Y. Afeefy, Joel F. Liebman, and Stephen E. Stein
Quantity | Value | Units | Method | Reference | Comment |
---|---|---|---|---|---|
ΔvapH° | 48.1 ± 0.2 | kJ/mol | C | Wadsö, Murto, et al., 1966 | AC |
ΔvapH° | 48.1 ± 0.2 | kJ/mol | C | Wadso, 1966 | ALS |

Reaction thermochemistry data

Data compiled by: Hussein Y. Afeefy, Joel F. Liebman, and Stephen E. Stein
Individual Reactions
By formula: C4H11N + C6H12OS = C4H10S + C6H13NO
Quantity | Value | Units | Method | Reference | Comment |
---|---|---|---|---|---|
ΔrH° | -57.74 ± 0.63 | kJ/mol | Cm | Wadso, 1958 | liquid phase; Heat of aminolysis |
By formula: H2O + C6H12OS = C4H10S + C2H4O2
Quantity | Value | Units | Method | Reference | Comment |
---|---|---|---|---|---|
ΔrH° | -4.6 ± 0.3 | kJ/mol | Cm | Wadso, 1957 | liquid phase; Heat of hydrolysis |

Kovats' RI, non-polar column, isothermal

Column type | Active phase | Temperature (C) | I | Reference | Comment |
---|---|---|---|---|---|
Packed | Apiezon M | 130. | 950. | Garbuzov, Misharina, et al., 1985 | He or N2, Chromosorb W, AW-DMCS; Column length: 2.1 m |
Packed | Apiezon M | 130. | 950. | Golovnya, Garbuzov, et al., 1981 | Chromosorb W, AW/DMCS; Column length: 2.1 m |

Normal alkane RI, non-polar column, custom temperature program

Column type | Active phase | I | Reference | Comment |
---|---|---|---|---|
Capillary | CP Sil 5 CB | 951. | Gijs, Piraprez, et al., 2000 | 50. m/0.32 mm/1.2 μm, He; Program: 33C (16.5min) => 2C/min => 160C => 20C/min => 200C (9min) |

References

Wadsö, Murto, et al., 1966
Wadsö, Ingemar; Murto, Maija-Leena; Bergson, Göran; Ehrenberg, L.; Brunvoll, J.; Bunnenberg, E.; Djerassi, Carl; Records, Ruth,
Heats of Vaporization for a Number of Organic Compounds at 25 degrees C.,
Acta Chem. Scand., 1966, 20, 544-552, https://doi.org/10.3891/acta.chem.scand.20-0544
. [all data]
Wadso, 1966
Wadso, I.,
Acta Chem. Scand., 1966, 20, 544. [all data]
Wadso, 1958
Wadso, I.,
The heats of aminolysis of n-butyl thiolacetate and acetic anhydride,
Acta Chem. Scand., 1958, 12, 635-640. [all data]
Wadso, 1957
Wadso, I.,
The heats of hydrolysis of some alkyl thiolesters,
Acta Chem. Scand., 1957, 11, 1745-1751. [all data]
Garbuzov, Misharina, et al., 1985
Garbuzov, V.G.; Misharina, T.A.; Aerov, A.F.; Golovnya, R.V.,
Gas chromatographic retention indices for sulphur(II)-containing organic substances,
J. Anal. Chem. USSR (Engl. Transl.), 1985, 40, 4, 576-586. [all data]
Golovnya, Garbuzov, et al., 1981
Golovnya, R.V.; Garbuzov, V.G.; Aérov, A.F.,
Comparison of the retention indices and differential molar free energies of solution for thiolic and carboxylic esters on gas-chromatographic columns with various polarities,
Izv. Akad. Nauk SSSR Ser. Khim., 1981, 10, 1877-1880. [all data]
Gijs, Piraprez, et al., 2000
Gijs, L.; Piraprez, G.; Perpète, P.; Spinnler, E.; Collin, S.,
Retention of sulfur flavours by food matrix and determination of sensorial data independent of the medium composition,
Food Chem., 2000, 69, 3, 319-330, https://doi.org/10.1016/S0956-7135(99)00111-5
. [all data]