1,4-Hexadiene, 2,5-dimethyl-
- Formula: C8H14
- Molecular weight: 110.1968
- IUPAC Standard InChIKey: JRFKHZNULLDOGQ-UHFFFAOYSA-N
- CAS Registry Number: 927-97-9
- Chemical structure:

Phase change data

Data compiled by: Thermodynamics Research Center, NIST Boulder Laboratories, Chris Muzny director
Quantity | Value | Units | Method | Reference | Comment |
---|---|---|---|---|---|
Tboil | 389.7 | K | N/A | Turk, 1941 | Uncertainty assigned by TRC = 2. K |

References

Turk, 1941
Turk, A.,
, Ph.D. Thesis, Ohio State Univ., Columbus, OH, 1941. [all data]