bis(trifluoromethyl) peroxide
- Formula: C2F6O2
- Molecular weight: 170.0106
- IUPAC Standard InChIKey: BPXRXDJNYFWRDI-UHFFFAOYSA-N
- CAS Registry Number: 927-84-4
- Chemical structure:
View 3d structure (requires JavaScript / HTML 5) - Other names: Di(trifluoromethyl)peroxide

Gas phase thermochemistry data

Data compiled by: Hussein Y. Afeefy, Joel F. Liebman, and Stephen E. Stein
Quantity | Value | Units | Method | Reference | Comment |
---|---|---|---|---|---|
ΔfH°gas | -1507. ± 13. | kJ/mol | Eqk | Levy and Kennedy, 1972 |

Reaction thermochemistry data

Data compiled by: Hussein Y. Afeefy, Joel F. Liebman, and Stephen E. Stein
Individual Reactions
=
+ CF4O
By formula: C2F6O2 = CF2O + CF4O
Quantity | Value | Units | Method | Reference | Comment |
---|---|---|---|---|---|
ΔrH° | 102.5 ± 2.9 | kJ/mol | Eqk | Levy and Kennedy, 1972 | gas phase |

References

Levy and Kennedy, 1972
Levy, J.B.; Kennedy, R.C.,
Bistrifluoromethyl peroxide. I. Thermodynamics of the equilibrium with carbonyl fluoride and trifluoromethyl hypofluorite,
J. Am. Chem. Soc., 1972, 94, 3302-3305. [all data]