Ethoxyacetylene
- Formula: C4H6O
- Molecular weight: 70.0898
- IUPAC Standard InChIKey: WMYNMYVRWWCRPS-UHFFFAOYSA-N
- CAS Registry Number: 927-80-0
- Chemical structure:
View 3d structure (requires JavaScript / HTML 5) - Other names: Ethyl ethynyl ether; Ethoxyethyne; Ethyne, ethoxy-; Ether, ethyl ethynyl

Phase change data

Data compiled by: Robert L. Brown and Stephen E. Stein
Reduced pressure boiling point
Tboil (K) | Pressure (bar) | Reference |
---|---|---|
326. to 327. | 0.973 | Farchan Laboratories, 1990 |

Normal alkane RI, non-polar column, temperature ramp

Column type | Active phase | I | Reference | Comment |
---|---|---|---|---|
Capillary | OV-101 | 498. | Zenkevich, 2005 | 25. m/0.20 mm/0.10 μm, N2/He, 6. K/min; Tstart: 50. C; Tend: 250. C |

Normal alkane RI, non-polar column, custom temperature program

Column type | Active phase | I | Reference | Comment |
---|---|---|---|---|
Capillary | Methyl Silicone | 498. | Zenkevich, 1996 | Program: not specified |

References

Farchan Laboratories, 1990
Farchan Laboratories,
Research Chemicals Catalog, Farchan Laboratories, Gainesville, FL, 1990, 91. [all data]
Zenkevich, 2005
Zenkevich, I.G.,
Experimentally measured retention indices., 2005. [all data]
Zenkevich, 1996
Zenkevich, I.G.,
Informational Maitenance of Gas Chromatographic Identification of Organic Compounds in Ecoanalytical Investigations,
Z. Anal. Chem., 1996, 51, 11, 1140-1148. [all data]