4-chlorobut-1-ene
- Formula: C4H7Cl
- Molecular weight: 90.551
- IUPAC Standard InChIKey: WKEVRZCQFQDCIR-UHFFFAOYSA-N
- CAS Registry Number: 927-73-1
- Chemical structure:
View 3d structure (requires JavaScript / HTML 5) - Other names: 1-Butene, 4-chloro-

Gas phase thermochemistry data

Data compiled by: Hussein Y. Afeefy, Joel F. Liebman, and Stephen E. Stein
Quantity | Value | Units | Method | Reference | Comment |
---|---|---|---|---|---|
ΔfH°gas | -28.9 | kJ/mol | Eqk | Levanova, Rodova, et al., 1974 |

Phase change data

Data compiled as indicated in comments:
TRC - Thermodynamics Research Center, NIST Boulder Laboratories, Chris Muzny director
BS - Robert L. Brown and Stephen E. Stein
Quantity | Value | Units | Method | Reference | Comment |
---|---|---|---|---|---|
Tboil | 347. | K | N/A | Bullock and Hand, 1950 | Uncertainty assigned by TRC = 4. K; TRC |
Tboil | 348. | K | N/A | Bullock and Hand, 1950 | Uncertainty assigned by TRC = 5. K; TRC |
Reduced pressure boiling point
Tboil (K) | Pressure (bar) | Reference | Comment |
---|---|---|---|
348.2 | 1.03 | Weast and Grasselli, 1989 | BS |

Reaction thermochemistry data

Data compiled by: Hussein Y. Afeefy, Joel F. Liebman, and Stephen E. Stein
Individual Reactions
By formula: C4H8Cl2 = HCl + C4H7Cl
Quantity | Value | Units | Method | Reference | Comment |
---|---|---|---|---|---|
ΔrH° | 75.3 | kJ/mol | Eqk | Levanova, Rodova, et al., 1974 | gas phase |
By formula: C4H7Cl = C4H7Cl
Quantity | Value | Units | Method | Reference | Comment |
---|---|---|---|---|---|
ΔrH° | -17. | kJ/mol | Eqk | Levanova, Rodova, et al., 1975 | gas phase |

References

Levanova, Rodova, et al., 1974
Levanova, S.V.; Rodova, R.M.; Rozhnov, A.M.; Shevtsova, L.A.,
Thermodynamic calculation of the equilibrium composition of chlorobutene mixtures,
Russ. J. Phys. Chem. (Engl. Transl.), 1974, 48, 1113-1114. [all data]
Bullock and Hand, 1950
Bullock, M.W.; Hand, J.J.,
, 1950. [all data]
Weast and Grasselli, 1989
CRC Handbook of Data on Organic Compounds, 2nd Editon, Weast,R.C and Grasselli, J.G., ed(s)., CRC Press, Inc., Boca Raton, FL, 1989, 1. [all data]
Levanova, Rodova, et al., 1975
Levanova, S.V.; Rodova, R.M.; Shevtsova, L.A.; Rozhnov, A.M.,
Isomerisation of chlorobutenes,
Russ. J. Phys. Chem. (Engl. Transl.), 1975, 49, 41-43. [all data]