Perfluoro-2,4,6,8,10,13,15.17,19,21-decaoxy-n-docosane

Phase change data

Data compiled by: William E. Acree, Jr., James S. Chickos

Quantity Value Units Method Reference Comment
Δvap74.6 ± 2.9kJ/molEBDruzhinina, Krol', et al., 2006Based on data from 397. - 468. K.

References

Druzhinina, Krol', et al., 2006
Druzhinina, A.I.; Krol', O.V.; Efimova, A.A.; Varushchenko, R.M.; Gervits, L.L., The temperature dependences of saturated vapor pressures and heat capacities of some perfluoropolyethers, Russ. J. Phys. Chem., 2006, 80, 11, 1742-1748, https://doi.org/10.1134/S0036024406110082 . [all data]