6-Undecanone
- Formula: C11H22O
- Molecular weight: 170.2918
- IUPAC Standard InChIKey: ZPQAKYPOZRXKFA-UHFFFAOYSA-N
- CAS Registry Number: 927-49-1
- Chemical structure:
View 3d structure (requires JavaScript / HTML 5) - Other names: Amyl ketone; Diamyl ketone; Dipentyl ketone; Pentyl ketone; Undecan-6-one; Undecanone-(6); 6-Oxoundecane; Di-N-amyl ketone

Gas phase thermochemistry data

Data compiled by: Hussein Y. Afeefy, Joel F. Liebman, and Stephen E. Stein
Quantity | Value | Units | Method | Reference | Comment |
---|---|---|---|---|---|
ΔfH°gas | -387.4 ± 2.0 | kJ/mol | Ccb | Harrop, Head, et al., 1970 |

Condensed phase thermochemistry data

Data compiled as indicated in comments:
ALS - Hussein Y. Afeefy, Joel F. Liebman, and Stephen E. Stein
DH - Eugene S. Domalski and Elizabeth D. Hearing
Quantity | Value | Units | Method | Reference | Comment |
---|---|---|---|---|---|
ΔfH°liquid | -448.1 ± 1.9 | kJ/mol | Ccb | Harrop, Head, et al., 1970 | ALS |
Quantity | Value | Units | Method | Reference | Comment |
ΔcH°liquid | -7024.6 ± 1.8 | kJ/mol | Ccb | Harrop, Head, et al., 1970 | Corresponding ΔfHºliquid = -448.14 kJ/mol (simple calculation by NIST; no Washburn corrections); ALS |
Constant pressure heat capacity of liquid
Cp,liquid (J/mol*K) | Temperature (K) | Reference | Comment |
---|---|---|---|
362.7 | 298.15 | Harrop, Head, et al., 1970 | An estimate.; DH |

Phase change data

Data compiled as indicated in comments:
BS - Robert L. Brown and Stephen E. Stein
TRC - Thermodynamics Research Center, NIST Boulder Laboratories, Chris Muzny director
AC - William E. Acree, Jr., James S. Chickos
ALS - Hussein Y. Afeefy, Joel F. Liebman, and Stephen E. Stein
Quantity | Value | Units | Method | Reference | Comment |
---|---|---|---|---|---|
Tboil | 490. ± 40. | K | AVG | N/A | Average of 6 values; Individual data points |
Quantity | Value | Units | Method | Reference | Comment |
Tfus | 285. ± 10. | K | AVG | N/A | Average of 8 values; Individual data points |
Quantity | Value | Units | Method | Reference | Comment |
Tc | 678.5 | K | N/A | Pulliam, Gude, et al., 1995 | Uncertainty assigned by TRC = 1.5 K; TRC |
Quantity | Value | Units | Method | Reference | Comment |
ρc | 1.44 | mol/l | N/A | Pulliam, Gude, et al., 1995 | Uncertainty assigned by TRC = 0.04 mol/l; TRC |
Quantity | Value | Units | Method | Reference | Comment |
ΔvapH° | 59. | kJ/mol | CGC | Chickos, Hosseini, et al., 1995 | Based on data from 343. to 383. K.; AC |
ΔvapH° | 61.8 | kJ/mol | CGC | Chickos, Hosseini, et al., 1995 | Based on data from 343. to 383. K.; AC |
ΔvapH° | 63.5 ± 0.5 | kJ/mol | GCC | Saluja, Peacock, et al., 1979 | AC |
ΔvapH° | 60.72 ± 0.50 | kJ/mol | E | Harrop, Head, et al., 1970 | ALS |
Enthalpy of vaporization
ΔvapH (kJ/mol) | Temperature (K) | Method | Reference | Comment |
---|---|---|---|---|
55.3 | 403. | A | Stephenson and Malanowski, 1987 | Based on data from 388. to 543. K.; AC |
50.4 | 476. | A | Stephenson and Malanowski, 1987 | Based on data from 461. to 513. K.; AC |
45.8 | 500. | N/A | Stridth and Sunner, 1975 | Based on data from 383. to 514. K.; AC |

Normal alkane RI, non-polar column, custom temperature program

Data compiled by: NIST Mass Spectrometry Data Center, William E. Wallace, director

Column type CapillaryCapillaryCapillary
Active phase SE-30SE-30Polydimethyl siloxane
Column length (m)
Carrier gas
Substrate
Column diameter (mm)
Phase thickness (μm)
Program not specifiednot specifiednot specified
I 1258.1258.1249.
ReferenceVinogradov, 2004Vinogradov, 2004Junkes, Castanho, et al., 2003
Comment MSDC-RI MSDC-RI MSDC-RI

Normal alkane RI, non-polar column, isothermal

Data compiled by: NIST Mass Spectrometry Data Center, William E. Wallace, director

Column type Capillary
Active phase OV-1
Column length (m)
Carrier gas
Substrate
Column diameter (mm)
Phase thickness (μm)
Temperature (C) 60.
I 1249.
ReferenceAmboni, Junkes, et al., 2002
Comment MSDC-RI

Normal alkane RI, polar column, temperature ramp

Data compiled by: NIST Mass Spectrometry Data Center, William E. Wallace, director

Column type Capillary
Active phase Carbowax 20M
Column length (m) 80.
Carrier gas
Substrate
Column diameter (mm) 0.2
Phase thickness (μm)
Tstart (C) 70.
Tend (C) 170.
Heat rate (K/min) 2.
Initial hold (min)
Final hold (min)
I 1528.
ReferenceAnker, Jurs, et al., 1990
Comment MSDC-RI

Kovats' RI, non-polar column, isothermal

View large format table.

Column type Active phase Temperature (C) I Reference Comment
PackedApiezon L130.1231.Wehrli and Kováts, 1959Celite; Column length: 2.25 m
PackedApiezon L190.1237.Wehrli and Kováts, 1959Celite; Column length: 2.25 m

Kovats' RI, non-polar column, temperature ramp

View large format table.

Column type Active phase I Reference Comment
CapillaryDB-11253.Takeoka, Perrino, et al., 199660. m/0.25 mm/0.25 μm, 30. C @ 4. min, 2. K/min; Tend: 220. C
CapillaryDB-11255.Takeoka, Perrino, et al., 199660. m/0.25 mm/0.25 μm, 30. C @ 4. min, 2. K/min; Tend: 220. C

Van Den Dool and Kratz RI, polar column, temperature ramp

View large format table.

Column type Active phase I Reference Comment
CapillaryDB-Wax1527.Nielsen, Larsen, et al., 200330. m/0.25 mm/0.25 μm, He, 40. C @ 10. min, 6. K/min, 240. C @ 30. min

Normal alkane RI, non-polar column, temperature ramp

View large format table.

Column type Active phase I Reference Comment
CapillaryOV-1011261.Zenkevich, Eliseenkov, et al., 201125. m/0.20 mm/0.25 μm, Nitrogen, 6. K/min; Tstart: 40. C; Tend: 240. C
CapillaryHP-5MS1274.Kim, El-Aty, et al., 200630. m/0.25 mm/0.25 μm, He, 50. C @ 4. min, 5. K/min, 280. C @ 10. min
CapillaryOV-1011258.Anker, Jurs, et al., 19902. K/min; Column length: 50. m; Column diameter: 0.28 mm; Tstart: 80. C; Tend: 200. C

Normal alkane RI, polar column, custom temperature program

View large format table.

Column type Active phase I Reference Comment
CapillaryCarbowax 20M1528.Vinogradov, 2004Program: not specified
CapillaryCarbowax 20M1528.Vinogradov, 2004Program: not specified

References

Harrop, Head, et al., 1970
Harrop, D.; Head, A.J.; Lewis, G.B.,
Thermodynamic properties of organic oxygen compounds. 22. Enthalpies of combustion of some aliphatic ketones,
J. Chem. Thermodyn., 1970, 2, 203-210. [all data]
Pulliam, Gude, et al., 1995
Pulliam, M.K.; Gude, M.T.; Teja, A.S.,
Critical Temperatures and Densities of n-Alkanones,
J. Chem. Eng. Data, 1995, 40, 455-8. [all data]
Chickos, Hosseini, et al., 1995
Chickos, James S.; Hosseini, Sarah; Hesse, Donald G.,
Determination of vaporization enthalpies of simple organic molecules by correlations of changes in gas chromatographic net retention times,
Thermochimica Acta, 1995, 249, 41-62, https://doi.org/10.1016/0040-6031(95)90670-3
. [all data]
Saluja, Peacock, et al., 1979
Saluja, P.P.S.; Peacock, L.A.; Fuchs, R.,
Enthalpies of interaction of aliphatic ketones with polar and nonpolar solvents,
J. Am. Chem. Soc., 1979, 101, 1958-1962. [all data]
Stephenson and Malanowski, 1987
Stephenson, Richard M.; Malanowski, Stanislaw,
Handbook of the Thermodynamics of Organic Compounds, 1987, https://doi.org/10.1007/978-94-009-3173-2
. [all data]
Stridth and Sunner, 1975
Stridth, G.; Sunner, S.,
Enthalpies of formation of some 1-chloroalkanes and the CH2-increment in the 1-chloroalkanes series,
J. Chem. Thermodyn., 1975, 7, 161-168. [all data]