Glycyl-dl-alanine
- Formula: C5H10N2O3
- Molecular weight: 146.1445
- IUPAC Standard InChIKey: VPZXBVLAVMBEQI-UHFFFAOYSA-N
- CAS Registry Number: 926-77-2
- Chemical structure:
View 3d structure (requires JavaScript / HTML 5) - Stereoisomers:
- Other names: DL-Alanine, N-glycyl-; N-glycyl-DL-alanine

Reaction thermochemistry data

Data compiled by: Robert C. Dunbar
Individual Reactions
By formula: Na+ + C5H10N2O3 = (Na+ • C5H10N2O3)
Quantity | Value | Units | Method | Reference | Comment |
---|---|---|---|---|---|
ΔrH° | 179. ± 7.1 | kJ/mol | CIDC | Cerda, Hoyau, et al., 1998 |

Ion clustering data

Data compiled by: Robert C. Dunbar
Clustering reactions
By formula: Na+ + C5H10N2O3 = (Na+ • C5H10N2O3)
Quantity | Value | Units | Method | Reference | Comment |
---|---|---|---|---|---|
ΔrH° | 179. ± 7.1 | kJ/mol | CIDC | Cerda, Hoyau, et al., 1998 |

References

Cerda, Hoyau, et al., 1998
Cerda, B.A.; Hoyau, S.; Ohanessian, G.; Wesdemiotis, C.,
PAs of Peptides,
J. Am. Chem. Soc., 1998, 120, 2437. [all data]