2-Ethoxypropene
- Formula: C5H10O
- Molecular weight: 86.1323
- IUPAC Standard InChIKey: FSGHEPDRMHVUCQ-UHFFFAOYSA-N
- CAS Registry Number: 926-66-9
- Chemical structure:
View 3d structure (requires JavaScript / HTML 5) - Permanent link for this species. Use this link for bookmarking this species for future reference.

Phase change data

Data compiled by: Thermodynamics Research Center, NIST Boulder Laboratories, Chris Muzny director
Quantity | Value | Units | Method | Reference | Comment |
---|---|---|---|---|---|
Tboil | 334.65 | K | N/A | Sherrill and Walter, 1936 | Uncertainty assigned by TRC = 0.5 K |
Quantity | Value | Units | Method | Reference | Comment |
Tfus | 166.2 | K | N/A | Anonymous, 1953 | Uncertainty assigned by TRC = 0.6 K |

Reaction thermochemistry data

Data compiled by: Hussein Y. Afeefy, Joel F. Liebman, and Stephen E. Stein
Individual Reactions
By formula: H2 + C5H10O = C5H12O
Quantity | Value | Units | Method | Reference | Comment |
---|---|---|---|---|---|
ΔrH° | -105. ± 0.4 | kJ/mol | Chyd | Dolliver, Gresham, et al., 1938 | gas phase; At 355°K |

References

Sherrill and Walter, 1936
Sherrill, M.L.; Walter, G.F.,
Preparation and Physical Constants of 2-Methylbutene-1,
J. Am. Chem. Soc., 1936, 58, 742. [all data]
Anonymous, 1953
Anonymous, R.,
, Physical Properties of Chemical Substances, Dow Chemical Company, 1953. [all data]
Dolliver, Gresham, et al., 1938
Dolliver, M.A.; Gresham, T.L.; Kistiakowsky, G.B.; Smith, E.A.; Vaughan, W.E.,
Heats of organic reactions. VI. Heats of hydrogenation of some oxygen-containing compounds,
J. Am. Chem. Soc., 1938, 60, 440-450. [all data]