1-Propanol, 2,2-dimethyl-, acetate
- Formula: C7H14O2
- Molecular weight: 130.1849
- IUPAC Standard InChIKey: QLNYTCSELYEEPV-UHFFFAOYSA-N
- CAS Registry Number: 926-41-0
- Chemical structure:
View 3d structure (requires JavaScript / HTML 5) - Other names: Neopentyl acetate; 2,2-Dimethyl-1-propanol acetate; 2,2-Dimethylpropyl acetate; 2,2-Dimethylpropyl ethanoate; Neopentyl alcohol, acetate; Acetic acid, neopentyl ester

Phase change data

Data compiled by: William E. Acree, Jr., James S. Chickos
Enthalpy of vaporization
ΔvapH (kJ/mol) | Temperature (K) | Method | Reference | Comment |
---|---|---|---|---|
49.1 | 316. | A | Stephenson and Malanowski, 1987 | Based on data from 301. to 400. K. |

Van Den Dool and Kratz RI, non-polar column, temperature ramp

Column type | Active phase | I | Reference | Comment |
---|---|---|---|---|
Capillary | 5 % Phenyl methyl siloxane | 816. | Zaikin, 2010 | 30. m/0.25 mm/0.25 μm, 15. K/min, 270. C @ 15. min; Tstart: 60. C |

Van Den Dool and Kratz RI, non-polar column, custom temperature program

Column type | Active phase | I | Reference | Comment |
---|---|---|---|---|
Capillary | VF-5MS | 810.9 | Tret'yakov, 2008 | 30. m/0.25 mm/0.25 μm, He; Program: Multi-step temperature program; T(initial)=60C; T(final)=270C |

References

Stephenson and Malanowski, 1987
Stephenson, Richard M.; Malanowski, Stanislaw,
Handbook of the Thermodynamics of Organic Compounds, 1987, https://doi.org/10.1007/978-94-009-3173-2
. [all data]
Zaikin, 2010
Zaikin, V.G.,
Personal communication: Retention indices measured during 2010, 2010. [all data]
Tret'yakov, 2008
Tret'yakov, K.V.,
Retention Data. NIST Mass Spectrometry Data Center., NIST Mass Spectrometry Data Center, 2008. [all data]