Proflavine
- Formula: C13H11N3
- Molecular weight: 209.2465
- IUPAC Standard InChIKey: WDVSHHCDHLJJJR-UHFFFAOYSA-N
- CAS Registry Number: 92-62-6
- Chemical structure:
View 3d structure (requires JavaScript / HTML 5) - Other names: 3,6-Acridinediamine; Acridine, 3,6-diamino-; 3,6-Diaminoacridine; 2,8-Diaminoacridinium; 3,6-Diaminoacridinium; Isoflav base; Proflavin; Profura; Progarmed; 3,7-Diamino-5-azaanthracene

Condensed phase thermochemistry data

Data compiled by: Hussein Y. Afeefy, Joel F. Liebman, and Stephen E. Stein
Quantity | Value | Units | Method | Reference | Comment |
---|---|---|---|---|---|
ΔcH°solid | -6711. ± 13. | kJ/mol | Ccb | Willis, 1947 | Reanalyzed by Cox and Pilcher, 1970, Original value = -6813. ± 4. kJ/mol |

References

Willis, 1947
Willis, J.B.,
The heats of combustion of some organic bases and their salts. The resonance energies of acridine and phenazine,
Trans. Faraday Soc., 1947, 43, 97-102. [all data]
Cox and Pilcher, 1970
Cox, J.D.; Pilcher, G.,
Thermochemistry of Organic and Organometallic Compounds, Academic Press, New York, 1970, 1-636. [all data]