3-Nonanone
- Formula: C9H18O
- Molecular weight: 142.2386
- IUPAC Standard InChIKey: IYTXKIXETAELAV-UHFFFAOYSA-N
- CAS Registry Number: 925-78-0
- Chemical structure:
View 3d structure (requires JavaScript / HTML 5) - Other names: n-Hexyl ethyl ketone; Ethyl hexyl ketone; Ethyl n-hexyl ketone; nonan-3-one

Phase change data

Data compiled as indicated in comments:
BS - Robert L. Brown and Stephen E. Stein
TRC - Thermodynamics Research Center, NIST Boulder Laboratories, Chris Muzny director
AC - William E. Acree, Jr., James S. Chickos
Quantity | Value | Units | Method | Reference | Comment |
---|---|---|---|---|---|
Tboil | 460.7 | K | N/A | Aldrich Chemical Company Inc., 1990 | BS |
Tboil | 460. to 463. | K | N/A | Frinton Laboratories Inc., 1986 | BS |
Tboil | 459. | K | N/A | Pickard and Kenyon, 1913 | Uncertainty assigned by TRC = 4. K; TRC |
Quantity | Value | Units | Method | Reference | Comment |
Tfus | 265. | K | N/A | Wagner, 1891 | Uncertainty assigned by TRC = 4. K; TRC |
Quantity | Value | Units | Method | Reference | Comment |
Tc | 648.1 | K | N/A | Pulliam, Gude, et al., 1994 | Uncertainty assigned by TRC = 0.25 K; by the sealed ampule method; TRC |
Quantity | Value | Units | Method | Reference | Comment |
ρc | 1.79 | mol/l | N/A | Pulliam, Gude, et al., 1994 | Uncertainty assigned by TRC = 0.02 mol/l; TRC |
Quantity | Value | Units | Method | Reference | Comment |
ΔvapH° | 56.6 ± 0.6 | kJ/mol | GCC | Saluja, Peacock, et al., 1979 | AC |
ΔvapH° | 56.4 ± 0.1 | kJ/mol | C | Sellers, 1977 | AC |
ΔvapH° | 56.4 | kJ/mol | N/A | Ambrose, Ellender, et al., 1975 | Based on data from 342. to 545. K.; AC |
Reduced pressure boiling point
Tboil (K) | Pressure (bar) | Reference | Comment |
---|---|---|---|
359.2 | 0.027 | Weast and Grasselli, 1989 | BS |
Enthalpy of vaporization
ΔvapH (kJ/mol) | Temperature (K) | Method | Reference | Comment |
---|---|---|---|---|
55.6 | 300. | N/A | Espinosa Diaz, Guetachew, et al., 1999 | Based on data from 285. to 454. K.; AC |
52.6 | 350. | A | Stephenson and Malanowski, 1987 | Based on data from 335. to 468. K.; AC |
52.7 | 348. | N/A | Meyer and Wagner, 1966 | Based on data from 335. to 437. K.; AC |

Van Den Dool and Kratz RI, non-polar column, temperature ramp

View large format table.

Column type Active phase I Reference Comment
CapillaryBPX-51091.Dickschat, Wenzel, et al., 200425. m/0.22 mm/0.25 μm, He, 50. C @ 5. min, 5. K/min; Tend: 300. C

Van Den Dool and Kratz RI, polar column, temperature ramp

View large format table.

Column type Active phase I Reference Comment
CapillaryZB-Wax1385.Brunton, Cronin, et al., 200260. m/0.32 mm/0.25 μm, He, 3. K/min; Tstart: 40. C; Tend: 220. C
CapillaryDB-Wax1335.Fröhlich, Duque, et al., 198930. m/0.25 mm/0.25 μm, He, 50. C @ 3. min, 4. K/min; Tend: 250. C
CapillaryDB-Wax1339.Fröhlich, Duque, et al., 198930. m/0.25 mm/0.25 μm, He, 50. C @ 3. min, 4. K/min; Tend: 250. C
CapillarySupelcowax-101360.Tanchotikul and Hsieh, 198960. m/0.25 mm/0.25 μm, 40. C @ 5. min, 2. K/min, 175. C @ 20. min
CapillarySupelcowax-101361.Tanchotikul and Hsieh, 198960. m/0.25 mm/0.25 μm, 40. C @ 5. min, 2. K/min, 175. C @ 20. min
CapillarySupelcowax-101360.Vejaphan, Hsieh, et al., 198860. m/0.25 mm/0.25 μm, 40. C @ 5. min, 2. K/min, 175. C @ 20. min
CapillarySupelcowax-101362.Vejaphan, Hsieh, et al., 198860. m/0.25 mm/0.25 μm, 40. C @ 5. min, 2. K/min, 175. C @ 20. min

Van Den Dool and Kratz RI, polar column, custom temperature program

View large format table.

Column type Active phase I Reference Comment
CapillaryDB-Wax1357.Pennarun, Prost, et al., 200330. m/0.32 mm/0.5 μm, He; Program: 50C => 6C/min => 70C => 4C/min => 150C => 10C/min => 250C
CapillaryDB-Wax1357.Pennarun, Prost, et al., 200230. m/0.32 mm/0.5 μm, He; Program: 50C => 6C/min => 70C => 4C/min => 150C => 10C/min => 250C

Normal alkane RI, non-polar column, temperature ramp

View large format table.

Column type Active phase I Reference Comment
CapillaryOV-1011082.Zenkevich, Eliseenkov, et al., 201125. m/0.20 mm/0.25 μm, Nitrogen, 6. K/min; Tstart: 40. C; Tend: 240. C
CapillaryCross-Linked Methylsilicone1064.Bravo and Hotchkiss, 1993He, 35. C @ 3. min, 4. K/min; Column length: 25. m; Column diameter: 0.32 mm; Tend: 225. C

Normal alkane RI, non-polar column, custom temperature program

View large format table.

Column type Active phase I Reference Comment
CapillarySE-301068.Vinogradov, 2004Program: not specified
CapillaryAT-51089.Usai, Atzei, et al., 200360. m/0.25 mm/0.25 μm, He; Program: 50 0C 5 0C/min -> 135 0C (1 min) 5 0C/min -> 225 0C (5 min) 5 0C/min -> 260 0C

Normal alkane RI, polar column, temperature ramp

View large format table.

Column type Active phase I Reference Comment
CapillaryPEG-20M1362.Narain, Almeida, et al., 200450. m/0.20 mm/0.20 μm, 40. C @ 5. min, 3. K/min, 180. C @ 30. min
CapillaryCarbowax 20M1355.Seifert and King, 1982He, 50. C @ 10. min, 1. K/min, 170. C @ 60. min; Column length: 150. m; Column diameter: 0.64 mm

Normal alkane RI, polar column, custom temperature program

View large format table.

Column type Active phase I Reference Comment
CapillaryCarbowax 20M1355.Vinogradov, 2004Program: not specified
CapillaryHP-Innowax1367.Baser, Demirci, et al., 200260. m/0.25 mm/0.25 μm, He; Program: 60 0C (10 min) 4 K/min -> 220 0C (10 min) 1 K/min -> 240 0C

References

Aldrich Chemical Company Inc., 1990
Aldrich Chemical Company Inc.,
Catalog Handbook of Fine Chemicals, Aldrich Chemical Company, Inc., Milwaukee WI, 1990, 1. [all data]
Frinton Laboratories Inc., 1986
Frinton Laboratories Inc.,
Catalog Number 11, Frinton Laboratories Inc., Vineland, NJ, 1986, 99. [all data]
Pickard and Kenyon, 1913
Pickard, R.H.; Kenyon, J.,
Investigations on the dependence of rotatory power on chemical constitution: IV the rotations of the normal secondary alcohols of the formula c(2)h(5).ch(oh).r,
J. Chem. Soc., 1913, 103, 1923-59. [all data]
Wagner, 1891
Wagner, G.,
J. Prakt. Chem., 1891, 44, 257. [all data]
Pulliam, Gude, et al., 1994
Pulliam, M.K.; Gude, M.T.; Teja, A.S.,
The Critical Properties of Twelve Isomeric n-Alkanones with Six to Nine Carbon Atoms,
Experimental Results for DIPPR 1990-91 Projects on Phase Equilibria and Pure Component Properties, 1994, 1994, DIPPR Data Ser. No. 2, p. 184-87. [all data]
Saluja, Peacock, et al., 1979
Saluja, P.P.S.; Peacock, L.A.; Fuchs, R.,
Enthalpies of interaction of aliphatic ketones with polar and nonpolar solvents,
J. Am. Chem. Soc., 1979, 101, 1958-1962. [all data]
Sellers, 1977
Sellers, P.,
Enthalpies of combustion and formation of 2-nonanone and 2-dodecanone,
J. Chem. Thermodyn., 1977, 9, 139-142. [all data]
Ambrose, Ellender, et al., 1975
Ambrose, D.; Ellender, J.H.; Lees, E.B.; Sprake, C.H.S.; Townsend, R.,
Thermodynamic properties of organic oxygen compounds XXXVIII. Vapour pressures of some aliphatic ketones,
The Journal of Chemical Thermodynamics, 1975, 7, 5, 453-472, https://doi.org/10.1016/0021-9614(75)90275-X
. [all data]
Weast and Grasselli, 1989
CRC Handbook of Data on Organic Compounds, 2nd Editon, Weast,R.C and Grasselli, J.G., ed(s)., CRC Press, Inc., Boca Raton, FL, 1989, 1. [all data]
Espinosa Diaz, Guetachew, et al., 1999
Espinosa Diaz, M.A.; Guetachew, T.; Landy, P.; Jose, J.; Voilley, A.,
Experimental and estimated saturated vapour pressures of aroma compounds,
Fluid Phase Equilibria, 1999, 157, 2, 257-270, https://doi.org/10.1016/S0378-3812(99)00016-3
. [all data]
Stephenson and Malanowski, 1987
Stephenson, Richard M.; Malanowski, Stanislaw,
Handbook of the Thermodynamics of Organic Compounds, 1987, https://doi.org/10.1007/978-94-009-3173-2
. [all data]
Meyer and Wagner, 1966
Meyer, Edwin F.; Wagner, Robert E.,
Cohesive Energies in Polar Organic Liquids,
J. Phys. Chem., 1966, 70, 10, 3162-3168, https://doi.org/10.1021/j100882a025
. [all data]