Piperazine, 1-phenyl-
- Formula: C10H14N2
- Molecular weight: 162.2316
- IUPAC Standard InChIKey: YZTJYBJCZXZGCT-UHFFFAOYSA-N
- CAS Registry Number: 92-54-6
- Chemical structure:
View 3d structure (requires JavaScript / HTML 5) - Other names: N-Phenylpiperazine; Phenylpiperazine; 1-Phenylpiperazine; 1-Fenylpiperazin

Phase change data

Data compiled as indicated in comments:
BS - Robert L. Brown and Stephen E. Stein
TRC - Thermodynamics Research Center, NIST Boulder Laboratories, Chris Muzny director
Quantity | Value | Units | Method | Reference | Comment |
---|---|---|---|---|---|
Tboil | 559.7 | K | N/A | Weast and Grasselli, 1989 | BS |
Quantity | Value | Units | Method | Reference | Comment |
Tfus | 292.0 | K | N/A | Anonymous, 1958 | Uncertainty assigned by TRC = 0.6 K; TRC |

References

Weast and Grasselli, 1989
CRC Handbook of Data on Organic Compounds, 2nd Editon, Weast,R.C and Grasselli, J.G., ed(s)., CRC Press, Inc., Boca Raton, FL, 1989, 1. [all data]
Anonymous, 1958
Anonymous, R.,
, Am. Pet. Inst. Res. Proj. 45, Ohio State Univ., 1958. [all data]
Darry-Henaut, et al., 1986
Darry-Henaut, A., et al.,
Spectroscopy Letters, 1986, 19, 1099. [all data]