Biphenyl
- Formula: C12H10
- Molecular weight: 154.2078
- IUPAC Standard InChIKey: ZUOUZKKEUPVFJK-UHFFFAOYSA-N
- CAS Registry Number: 92-52-4
- Chemical structure:
View 3d structure (requires JavaScript / HTML 5) - Isotopologues:
- Other names: 1,1'-Biphenyl; Bibenzene; Diphenyl; Phenylbenzene; 1,1'-Diphenyl; Lemonene; Phenador-X; PhPh; Xenene; Carolid AL; Tetrosin LY; NSC 14916; 1,1-Biphenyl

Gas phase thermochemistry data

Data compiled as indicated in comments:
DRB - Donald R. Burgess, Jr.
ALS - Hussein Y. Afeefy, Joel F. Liebman, and Stephen E. Stein
GT - Glushko Thermocenter, Russian Academy of Sciences, Moscow
Quantity | Value | Units | Method | Reference | Comment |
---|---|---|---|---|---|
ΔfH°gas | 180. ± 3. | kJ/mol | AVG | N/A | Average of 6 values; Individual data points |
Constant pressure heat capacity of gas
Cp,gas (J/mol*K) | Temperature (K) | Reference | Comment |
---|---|---|---|
50.35 | 50. | Dorofeeva O.V., 1997 | None of the statistically calculated values of S(T) known from literature [ Trevissoi C., 1955, Katon J.E., 1959, Aleman H., 1973, Thermodynamics Research Center, 1997] is in full accord with experimental data (see also discussion in [ Chirico R.D., 1989]). Recommended values agree with experimental values within their uncertainties except for temperature range 340-460 K where discrepancies amount to 0.4-0.6 J/mol*K.; GT |
64.83 | 100. | ||
84.28 | 150. | ||
108.91 | 200. | ||
151.47 | 273.15 | ||
166.7 ± 1.0 | 298.15 | ||
167.80 | 300. | ||
225.53 | 400. | ||
273.62 | 500. | ||
311.78 | 600. | ||
342.14 | 700. | ||
366.75 | 800. | ||
387.07 | 900. | ||
404.06 | 1000. | ||
418.42 | 1100. | ||
430.64 | 1200. | ||
441.10 | 1300. | ||
450.09 | 1400. | ||
457.86 | 1500. |

Phase change data

Data compiled as indicated in comments:
BS - Robert L. Brown and Stephen E. Stein
TRC - Thermodynamics Research Center, NIST Boulder Laboratories, Chris Muzny director
AC - William E. Acree, Jr., James S. Chickos
ALS - Hussein Y. Afeefy, Joel F. Liebman, and Stephen E. Stein
DRB - Donald R. Burgess, Jr.
DH - Eugene S. Domalski and Elizabeth D. Hearing
CAL - James S. Chickos, William E. Acree, Jr., Joel F. Liebman, Students of Chem 202 (Introduction to the Literature of Chemistry), University of Missouri -- St. Louis
Quantity | Value | Units | Method | Reference | Comment |
---|---|---|---|---|---|
Tboil | 527. ± 2. | K | AVG | N/A | Average of 40 out of 42 values; Individual data points |
Quantity | Value | Units | Method | Reference | Comment |
Tfus | 343. ± 1. | K | AVG | N/A | Average of 285 out of 294 values; Individual data points |
Quantity | Value | Units | Method | Reference | Comment |
Ttriple | 342.090 | K | N/A | Chirico, Knipmeyer, et al., 1989 | Uncertainty assigned by TRC = 0.01 K; TRC |
Ttriple | 341.8 | K | N/A | Parks and Huffman, 1931 | Uncertainty assigned by TRC = 0.3 K; TRC |
Quantity | Value | Units | Method | Reference | Comment |
Tc | 780. ± 20. | K | AVG | N/A | Average of 7 values; Individual data points |
Quantity | Value | Units | Method | Reference | Comment |
Pc | 35. ± 6. | bar | AVG | N/A | Average of 8 values; Individual data points |
Quantity | Value | Units | Method | Reference | Comment |
Vc | 0.497 | l/mol | N/A | Tsonopoulos and Ambrose, 1995 | |
Quantity | Value | Units | Method | Reference | Comment |
ρc | 2.0 ± 0.1 | mol/l | N/A | Tsonopoulos and Ambrose, 1995 | |
ρc | 2.01 | mol/l | N/A | Ellard and Yanko, 1963 | Uncertainty assigned by TRC = 0.065 mol/l; TRC |
ρc | 2.09 | mol/l | N/A | Reiter, 1963 | Uncertainty assigned by TRC = 0.065 mol/l; TRC |
ρc | 1.99 | mol/l | N/A | Mandel and Ewbank, 1960 | Uncertainty assigned by TRC = 0.097 mol/l; TRC |
Quantity | Value | Units | Method | Reference | Comment |
ΔvapH° | 62. ± 10. | kJ/mol | AVG | N/A | Average of 7 values; Individual data points |
Quantity | Value | Units | Method | Reference | Comment |
ΔsubH° | 82. ± 3. | kJ/mol | AVG | N/A | Average of 10 values; Individual data points |
Reduced pressure boiling point
Tboil (K) | Pressure (bar) | Reference | Comment |
---|---|---|---|
418.2 | 0.029 | Weast and Grasselli, 1989 | BS |
418. | 0.029 | Buckingham and Donaghy, 1982 | BS |
343. to 351. | 0.0003 | Buckingham and Donaghy, 1982 | BS |
Enthalpy of vaporization
ΔvapH (kJ/mol) | Temperature (K) | Method | Reference | Comment |
---|---|---|---|---|
51.2 | 510. | DSC | Back, Grzyll, et al., 1996 | Based on data from 495. to 688. K.; AC |
57.4 | 400. | EB | Chirico, Knipmeyer, et al., 1989, 2 | Based on data from 350. to 578. K.; AC |
60.3 | 360. | EB | Chirico, Knipmeyer, et al., 1989, 2 | Based on data from 350. to 578. K.; AC |
50.4 | 500. | EB | Chirico, Knipmeyer, et al., 1989, 2 | Based on data from 350. to 578. K.; AC |
59.6 | 363. | GS | Sakoguchi, Iwai, et al., 1989 | Based on data from 348. to 453. K.; AC |
60.4 | 363. | N/A | Sasse, N'guimbi, et al., 1989 | Based on data from 333. to 393. K.; AC |
57.3 | 405. | A | Stephenson and Malanowski, 1987 | Based on data from 390. to 563. K.; AC |
54.9 | 417. | GS | Nasir, Hwang, et al., 1980 | Based on data from 396. to 437. K.; AC |
48.0 | 647. | N/A | Glaser and Rüland, 1957 | Based on data from 528. to 766. K.; AC |
59.4 | 357. | N/A | Cunningham, 1930 | Based on data from 342. to 544. K. See also Boublik, Fried, et al., 1984.; AC |
Antoine Equation Parameters
log10(P) = A − (B / (T + C))
P = vapor pressure (bar)
T = temperature (K)
View plot Requires a JavaScript / HTML 5 canvas capable browser.
Temperature (K) | A | B | C | Reference | Comment |
---|---|---|---|---|---|
342.3 to 544.3 | 4.35685 | 1987.623 | -71.556 | Cunningham, 1930, 2 | Coefficents calculated by NIST from author's data. |
Enthalpy of sublimation
ΔsubH (kJ/mol) | Temperature (K) | Method | Reference | Comment |
---|---|---|---|---|
81.520 | 298.15 | N/A | Chirico, Knipmeyer, et al., 1989, 2 | DH |
81.8 | 383. | GS | Nass, Lenoir, et al., 1995 | Based on data from 313. to 453. K.; AC |
83.4 | 311. | EM | Sasse, N'guimbi, et al., 1989 | Based on data from 283. to 338. K.; AC |
76.0 ± 4.0 | 273. to 313. | HSA | Chickos, 1975 | AC |
80.4 ± 1.6 | 319. | TSGC | Clark, Knox, et al., 1975 | Based on data from 306. to 332. K.; AC |
75.2 | 298. to 318. | ME | Pribilová and Pouchlý, 1974 | AC |
83.6 ± 2.5 | 283. | V | Radchenko and Kitaigorodskii, 1974 | ALS |
75.81 ± 0.59 | 342.5 | V | Aihara, 1959 | ALS |
75.8 ± 0.6 | 289. | N/A | Aihara, 1955 | Based on data from 279. to 299. K.; AC |
81.6 ± 1.7 | 301. | N/A | Bradley and Cleasby, 1953 | Based on data from 288. to 314. K.; AC |
81.588 | 288.05 | V | Bradley and Cleasby, 1953, 2 | ALS |
75.1 ± 1.7 | 297. | N/A | Seki and Suzuki, 1953 | Based on data from 287. to 307. K.; AC |
68.6 ± 0.8 | 292. | QF | Wolf and Weghofer, 1938 | AC |
68.6 ± 0.8 | 295. | V | Wolf and Weghofer, 1938, 2 | ALS |
Entropy of sublimation
ΔsubS (J/mol*K) | Temperature (K) | Reference | Comment |
---|---|---|---|
273.42 | 298.15 | Chirico, Knipmeyer, et al., 1989, 2 | DH |
Enthalpy of fusion
ΔfusH (kJ/mol) | Temperature (K) | Method | Reference | Comment |
---|---|---|---|---|
18.5760 | 342.098 | N/A | Chirico, Knipmeyer, et al., 1989, 2 | DH |
18.580 | 342.2 | N/A | O'Rourke and Mraw, 1983 | DH |
18.800 | 344.1 | N/A | Smith, 1979 | DH |
18.648 | 341.5 | N/A | Spaght, Thomas, et al., 1932 | DH |
19.7 | 342.3 | DSC | Khimeche and Dahmani, 2006 | AC |
19.27 | 344.34 | DSC | Benkhennouf, Kamel, et al., 2004 | AC |
18.66 | 341.5 | N/A | Domalski and Hearing, 1996 | AC |
18.575 | 343. | N/A | Ueberreiter and Orthmann, 1950 | DH |
18.594 | 342. | N/A | Schmidt, 1941 | DH |
18.945 | 314.3 | N/A | Eykman, 1889 | DH |
Entropy of fusion
ΔfusS (J/mol*K) | Temperature (K) | Reference | Comment |
---|---|---|---|
54.300 | 342.098 | Chirico, Knipmeyer, et al., 1989, 2 | DH |
54.3 | 342.2 | O'Rourke and Mraw, 1983 | DH |
54.6 | 344.1 | Smith, 1979 | DH |
54.6 | 341.5 | Spaght, Thomas, et al., 1932 | DH |
54.81 | 341.5 | Domalski and Hearing, 1996 | CAL |
54.2 | 343. | Ueberreiter and Orthmann, 1950 | DH |
54.4 | 342. | Schmidt, 1941 | DH |
60.3 | 314.3 | Eykman, 1889 | DH |
Enthalpy of phase transition
ΔHtrs (kJ/mol) | Temperature (K) | Initial Phase | Final Phase | Reference | Comment |
---|---|---|---|---|---|
0.00015 | 16.8 | crystaline, III | crystaline, II | Saito, Atake, et al., 1988 | DH |
0.00502 | 40.4 | crystaline, II | crystaline, I | Saito, Atake, et al., 1988 | Twist transition.; DH |
0.00015 | 16.8 | crystaline, III | crystaline, II | Atake, Saito, et al., 1983 | Anomalous region: 15.3 to 18.3 K.; DH |
0.00502 | 40.4 | crystaline, II | crystaline, I | Atake, Saito, et al., 1983 | Anomalous region: 30 to 47 K.; DH |
0.000293 | 11.0 | crystaline, III | crystaline, II | Ataki and Chihara, 1980 | DH |
0.00502 | 40.4 | crystaline, II | crystaline, I | Ataki and Chihara, 1980 | DH |
19.900 | 343.3 | crystaline, I | liquid | Wasicki, Radomska, et al., 1982 | DH |
Entropy of phase transition
ΔStrs (J/mol*K) | Temperature (K) | Initial Phase | Final Phase | Reference | Comment |
---|---|---|---|---|---|
0.009 | 16.8 | crystaline, III, Lock | crystaline, II, in transition | Saito, Atake, et al., 1988 | DH |
0.129 | 40.4 | crystaline, II | crystaline, I | Saito, Atake, et al., 1988 | Twist; DH |
0.009 | 16.8 | crystaline, III | crystaline, II | Atake, Saito, et al., 1983 | Anomalous; DH |
0.129 | 40.4 | crystaline, II | crystaline, I | Atake, Saito, et al., 1983 | Anomalous; DH |
0.025 | 11.0 | crystaline, III | crystaline, II | Ataki and Chihara, 1980 | DH |
0.129 | 40.4 | crystaline, II | crystaline, I | Ataki and Chihara, 1980 | DH |
58.0 | 343.3 | crystaline, I | liquid | Wasicki, Radomska, et al., 1982 | DH |

Henry's Law data

Data compiled by: Rolf Sander
Henry's Law constant (water solution)
kH(T) = k°H exp(d(ln(kH))/d(1/T) ((1/T) - 1/(298.15 K)))
k°H = Henry's law constant for solubility in water at 298.15 K (mol/(kg*bar))
d(ln(kH))/d(1/T) = Temperature dependence constant (K)
k°H (mol/(kg*bar)) | d(ln(kH))/d(1/T) (K) | Method | Reference | Comment |
---|---|---|---|---|
1.2 | Q | N/A | missing citation give several references for the Henry's law constants but don't assign them to specific species. | |
3.6 | L | N/A | ||
3.3 | M | N/A | ||
2.5 | M | Mackay, Shiu, et al., 1979 | ||
1.2 | V | Bohon and Claussen, 1951 |

Reaction thermochemistry data

Data compiled as indicated in comments:
M - Michael M. Meot-Ner (Mautner) and Sharon G. Lias
MS - José A. Martinho Simões
ALS - Hussein Y. Afeefy, Joel F. Liebman, and Stephen E. Stein
Individual Reactions
By formula: C10H8+ + C12H10 = (C10H8+ • C12H10)
Bond type: Charge transfer bond (positive ion)
Quantity | Value | Units | Method | Reference | Comment |
---|---|---|---|---|---|
ΔrH° | 56.5 | kJ/mol | PHPMS | Meot-Ner (Mautner), 1980 | gas phase; Entropy change calculated or estimated; M |
Quantity | Value | Units | Method | Reference | Comment |
ΔrS° | 120. | J/mol*K | N/A | Meot-Ner (Mautner), 1980 | gas phase; Entropy change calculated or estimated; M |
Free energy of reaction
ΔrG° (kJ/mol) | T (K) | Method | Reference | Comment |
---|---|---|---|---|
22. | 297. | PHPMS | Meot-Ner (Mautner), 1980 | gas phase; Entropy change calculated or estimated; M |
By formula: C12H8+ + C12H10 = (C12H8+ • C12H10)
Bond type: Charge transfer bond (positive ion)
Quantity | Value | Units | Method | Reference | Comment |
---|---|---|---|---|---|
ΔrH° | 56.1 | kJ/mol | PHPMS | Meot-Ner (Mautner), 1980 | gas phase; Entropy change calculated or estimated; M |
Quantity | Value | Units | Method | Reference | Comment |
ΔrS° | 120. | J/mol*K | N/A | Meot-Ner (Mautner), 1980 | gas phase; Entropy change calculated or estimated; M |
Free energy of reaction
ΔrG° (kJ/mol) | T (K) | Method | Reference | Comment |
---|---|---|---|---|
23. | 279. | PHPMS | Meot-Ner (Mautner), 1980 | gas phase; Entropy change calculated or estimated; M |
C17H24F3N3O3RuS (solution) + (solution) = C23H25F3O3RuS (solution) + 3
(solution)
By formula: C17H24F3N3O3RuS (solution) + C12H10 (solution) = C23H25F3O3RuS (solution) + 3C2H3N (solution)
Quantity | Value | Units | Method | Reference | Comment |
---|---|---|---|---|---|
ΔrH° | -15.1 ± 0.4 | kJ/mol | RSC | Nolan, Martin, et al., 1992 | solvent: Tetrahydrofuran; MS |
By formula: 3H2 + C12H10 = C12H16
Quantity | Value | Units | Method | Reference | Comment |
---|---|---|---|---|---|
ΔrH° | -230. | kJ/mol | Eqk | Frye, 1962 | liquid phase; ALS |

Gas phase ion energetics data

Data evaluated as indicated in comments:
HL - Edward P. Hunter and Sharon G. Lias
L - Sharon G. Lias
Data compiled as indicated in comments:
MM - Michael M. Meot-Ner (Mautner)
LLK - Sharon G. Lias, Rhoda D. Levin, and Sherif A. Kafafi
RDSH - Henry M. Rosenstock, Keith Draxl, Bruce W. Steiner, and John T. Herron
B - John E. Bartmess
Quantity | Value | Units | Method | Reference | Comment |
---|---|---|---|---|---|
IE (evaluated) | 8.16 ± 0.13 | eV | N/A | N/A | L |
Quantity | Value | Units | Method | Reference | Comment |
Proton affinity (review) | 813.6 | kJ/mol | N/A | Hunter and Lias, 1998 | HL |
Quantity | Value | Units | Method | Reference | Comment |
Gas basicity | 782.9 | kJ/mol | N/A | Hunter and Lias, 1998 | HL |
Electron affinity determinations
EA (eV) | Method | Reference | Comment |
---|---|---|---|
<0.130 ± 0.035 | ECD | Wojnarovits and Foldiak, 1981 | EA is an upper limit: Chen and Wentworth, 1989. G3MP2B3 calculations indicate an EA of ca. -0.02 eV, anion unbound.; B |
Proton affinity at 298K
Proton affinity (kJ/mol) | Reference | Comment |
---|---|---|
808.8 | Aue, Guidoni, et al., 2000 | Experimental literature data re-evaluated by the authors using ab initio protonation entropies; MM |
Gas basicity at 298K
Gas basicity (review) (kJ/mol) | Reference | Comment |
---|---|---|
780.7 | Aue, Guidoni, et al., 2000 | Experimental literature data re-evaluated by the authors using ab initio protonation entropies; MM |
Ionization energy determinations
IE (eV) | Method | Reference | Comment |
---|---|---|---|
8.80 ± 0.05 | EI | Loudon and Mazengo, 1974 | LLK |
8.9 | EI | Koppel, Schwarz, et al., 1974 | LLK |
7.95 ± 0.02 | PE | Maier and Turner, 1972 | LLK |
8.23 ± 0.01 | PE | Dewar, Haselbach, et al., 1970 | RDSH |
8.20 ± 0.05 | PE | Eland and Danby, 1968 | RDSH |
8.46 | CTS | Slifkin and Allison, 1967 | RDSH |
8.22 ± 0.15 | EI | Eland, Shepherd, et al., 1966 | RDSH |
8.27 ± 0.01 | PI | Watanabe, Nakayama, et al., 1962 | RDSH |
8.64 | CTS | Kinoshita, 1962 | RDSH |
8.35 | CTS | Briegleb, Czekalla, et al., 1961 | RDSH |
8.4 | CTS | Briegleb and Czekalla, 1959 | RDSH |
8.39 | PE | Akiyama, Li, et al., 1979 | Vertical value; LLK |
8.34 | PE | Ruscic, Kovac, et al., 1978 | Vertical value; LLK |
Appearance energy determinations
Ion | AE (eV) | Other Products | Method | Reference | Comment |
---|---|---|---|---|---|
C6H4+ | 18.1 ± 0.3 | ? | EI | Natalis and Franklin, 1965 | RDSH |
C6H5+ | 18.2 ± 0.5 | ? | EI | Natalis and Franklin, 1965 | RDSH |
C7H5+ | 20.9 ± 0.2 | ? | EI | Natalis and Franklin, 1965 | RDSH |
C8H6+ | 18.10 ± 0.05 | ? | EI | Natalis and Franklin, 1965 | RDSH |
C9H7+ | 16.08 ± 0.05 | ? | EI | Natalis and Franklin, 1965 | RDSH |
C10H8+ | 14.81 ± 0.05 | ? | EI | Natalis and Franklin, 1965 | RDSH |
C11H7+ | 14.8 ± 0.2 | CH3 | EI | Loudon and Mazengo, 1974 | LLK |
C12H8+ | 16.89 ± 0.08 | ? | EI | Natalis and Franklin, 1965 | RDSH |
C12H9+ | 13.6 ± 0.2 | H | EI | Loudon and Mazengo, 1974 | LLK |
C12H9+ | 14.36 | H | EI | Natalis and Franklin, 1965 | RDSH |
C12H82+ | 22.0 ± 1.0 | ? | EI | Natalis and Franklin, 1965 | RDSH |

Ion clustering data

Data compiled by: Michael M. Meot-Ner (Mautner) and Sharon G. Lias
Clustering reactions
By formula: C10H8+ + C12H10 = (C10H8+ • C12H10)
Bond type: Charge transfer bond (positive ion)
Quantity | Value | Units | Method | Reference | Comment |
---|---|---|---|---|---|
ΔrH° | 56.5 | kJ/mol | PHPMS | Meot-Ner (Mautner), 1980 | gas phase; Entropy change calculated or estimated |
Quantity | Value | Units | Method | Reference | Comment |
ΔrS° | 120. | J/mol*K | N/A | Meot-Ner (Mautner), 1980 | gas phase; Entropy change calculated or estimated |
Free energy of reaction
ΔrG° (kJ/mol) | T (K) | Method | Reference | Comment |
---|---|---|---|---|
22. | 297. | PHPMS | Meot-Ner (Mautner), 1980 | gas phase; Entropy change calculated or estimated |
By formula: C12H8+ + C12H10 = (C12H8+ • C12H10)
Bond type: Charge transfer bond (positive ion)
Quantity | Value | Units | Method | Reference | Comment |
---|---|---|---|---|---|
ΔrH° | 56.1 | kJ/mol | PHPMS | Meot-Ner (Mautner), 1980 | gas phase; Entropy change calculated or estimated |
Quantity | Value | Units | Method | Reference | Comment |
ΔrS° | 120. | J/mol*K | N/A | Meot-Ner (Mautner), 1980 | gas phase; Entropy change calculated or estimated |
Free energy of reaction
ΔrG° (kJ/mol) | T (K) | Method | Reference | Comment |
---|---|---|---|---|
23. | 279. | PHPMS | Meot-Ner (Mautner), 1980 | gas phase; Entropy change calculated or estimated |

Condensed phase thermochemistry data

Data compiled as indicated in comments:
DH - Eugene S. Domalski and Elizabeth D. Hearing
DRB - Donald R. Burgess, Jr.
ALS - Hussein Y. Afeefy, Joel F. Liebman, and Stephen E. Stein
Quantity | Value | Units | Method | Reference | Comment |
---|---|---|---|---|---|
ΔfH°solid | 23.5 ± 0.60 | kcal/mol | Review | Roux, Temprado, et al., 2008 | There are sufficient high-quality literature values to make a good evaluation with a high degree of confidence. In general, the evaluated uncertainty limits are on the order of (0.5 to 2.5) kJ/mol.; DRB |
ΔfH°solid | 23.12 ± 0.62 | kcal/mol | Ccb | Montgomery, Rossini, et al., 1978 | ALS |
ΔfH°solid | 24.02 ± 0.36 | kcal/mol | Ccb | Coleman and Pilcher, 1966 | ALS |
ΔfH°solid | 23.14 ± 0.96 | kcal/mol | Ccb | Mackle and O'Hare, 1963 | ALS |
ΔfH°solid | 23.24 ± 0.39 | kcal/mol | Ccb | Parks and Vaughan, 1951 | Reanalyzed by Cox and Pilcher, 1970, Original value = 23.10 kcal/mol; ALS |
Quantity | Value | Units | Method | Reference | Comment |
ΔcH°solid | -1494. ± 5. | kcal/mol | AVG | N/A | Average of 7 values; Individual data points |
Quantity | Value | Units | Method | Reference | Comment |
S°solid,1 bar | 50.043 | cal/mol*K | N/A | Chirico, Knipmeyer, et al., 1989 | DH |
S°solid,1 bar | 49.952 | cal/mol*K | N/A | Saito, Atake, et al., 1988 | DH |
S°solid,1 bar | 49.21 | cal/mol*K | N/A | Huffman, Parks, et al., 1930 | Extrapolation below 90 K, 65.4 J/mol*K.; DH |
Constant pressure heat capacity of liquid
Cp,liquid (cal/mol*K) | Temperature (K) | Reference | Comment |
---|---|---|---|
68.19 | 370. | Walker, Brooks, et al., 1958 | T = 200 to 600°F.; DH |
71.99 | 422. | McEwen, March 31 1956 | T = 300 to 600°C.; DH |
71.70 | 370. | Kurbatov, 1950 | T = 98 to 255°C. Mp 70.8°C.; DH |
62.91 | 350.8 | Forrest, Brugmann, et al., 1931 | T = 350 to 620 K. Value is unsmoothed experimental datum.; DH |
62.032 | 298. | Newton, Kaura, et al., 1931 | T = 100 to 300°C, equation only, in t°C. Cp(liq) = 0.388 + 0.00057t cal/g*K.; DH |
Constant pressure heat capacity of solid
Cp,solid (cal/mol*K) | Temperature (K) | Reference | Comment |
---|---|---|---|
47.416 | 298.15 | Chirico, Knipmeyer, et al., 1989 | T = 5 to 700 K.; DH |
47.364 | 298.15 | Saito, Atake, et al., 1988 | T = 3 to 300 K.; DH |
47.25 | 298.15 | O'Rourke and Mraw, 1983 | T = 220 to 475 K. Cp = 0.7143 (T/K) - 15.3 (220 to 342.2 K) J/mol*K.; DH |
45.4 | 300. | Wasicki, Radomska, et al., 1982 | T = 180 to 350 K. Data given graphically. Value estimated from graph.; DH |
45.60 | 298.15 | Ueberreiter and Orthmann, 1950 | T = 293 to 368 K. Equation only.; DH |
47.30 | 298.1 | Schmidt, 1941 | T = 20 to 200°C, equations only, in t°C. Cp(c) = 0.2745 + 0.001235t cal/g*K (20 to 69°C); Cp(liq) = 0.3917 + 0.0005206t cal/g*K (69 to 200°C).; DH |
47.30 | 303. | Spaght, Thomas, et al., 1932 | T = 30 to 100°C.; DH |
46.39 | 294.4 | Huffman, Parks, et al., 1930 | T = 93 to 295 K. Value is unsmoothed experimental datum.; DH |

Van Den Dool and Kratz RI, polar column, temperature ramp

Data compiled by: NIST Mass Spectrometry Data Center, William E. Wallace, director

Column type CapillaryCapillaryCapillary
Active phase Supelcowax-10HP-InnowaxSupelcowax-10
Column length (m) 60.30.60.
Carrier gas HeN2He
Substrate
Column diameter (mm) 0.250.250.25
Phase thickness (μm) 0.250.250.25
Tstart (C) 35.60.35.
Tend (C) 195.220.195.
Heat rate (K/min) 2.5.2.
Initial hold (min) 5. 5.
Final hold (min) 90. 90.
I 1996.2016.1996.
ReferenceChung, Yung, et al., 2002Adamiec, Rossner, et al., 2001Chung, Yung, et al., 2001
Comment MSDC-RI MSDC-RI MSDC-RI

Normal alkane RI, polar column, isothermal

Data compiled by: NIST Mass Spectrometry Data Center, William E. Wallace, director

Column type Capillary
Active phase PEG-40M
Column length (m)
Carrier gas
Substrate
Column diameter (mm)
Phase thickness (μm)
Temperature (C) 180.
I 2030.
ReferenceRoshchupkina, Pimerzin, et al., 1987
Comment MSDC-RI

Lee's RI, non-polar column, custom temperature program

Data compiled by: NIST Mass Spectrometry Data Center, William E. Wallace, director

Column type CapillaryCapillaryCapillaryCapillaryCapillary
Active phase DB-5HP-5MSHP-5MSHP-5MSDB-5MS
Column length (m) 60.30.30.30.60.
Carrier gas  HeHeHe
Substrate
Column diameter (mm)  0.250.250.250.25
Phase thickness (μm)  0.250.250.25
Program not specified60C(2min) => 6C/min => 258C => 2C/min => 300C(4min)not specifiednot specifiednot specified
I 236.6236.56236.39236.56235.5
ReferenceFuentes, Font, et al., 2007Wang, Li, et al., 2007Wang, Li, et al., 2007, 2Wang, Li, et al., 2007, 2Aracil, Font, et al., 2005
Comment MSDC-RI MSDC-RI MSDC-RI MSDC-RI MSDC-RI
Column type CapillaryCapillaryCapillaryCapillaryCapillary
Active phase HP-5MSLM-5Ultra-1DB-5LM-5
Column length (m) 30.30.50.30.30.
Carrier gas HeHeNitrogen He
Substrate
Column diameter (mm) 0.300.250.320.250.25
Phase thickness (μm) 0.250.250.500.250.25
Program 50 0C (2 min) 8 0C/min -> 120 0C (3 min) 10 0C/min -> 230 0C60C(2min) => 15C/min => 180C => 5C/min => 280C (10min)40-100 0C 3-15 0C/min -> 290 0Cnot specified60C(2min) => 15C/min => 180C => 5C/min => 280C(5min)
I 240.35229.33235.0235.0229.21
ReferenceCheng, Liu, et al., 2005Ré-Poppi and Santiago-Silva, 2005Sremac, Skrbic, et al., 2005Lundstedt, Haglund, et al., 2003Ré-Poppi and Santiago-Silva, 2002
Comment MSDC-RI MSDC-RI MSDC-RI MSDC-RI MSDC-RI
Column type CapillaryCapillaryCapillaryCapillaryCapillary
Active phase HP-5SE-52SE-54SE-54DB-5
Column length (m) 25.30.30. 30.
Carrier gas He   He
Substrate
Column diameter (mm) 0.20.300.25 0.25
Phase thickness (μm) 0.11   0.25
Program 106C(0.2min) => 40C/min => 120C => 3C/min => 310C(10min)not specifiednot specifiednot specified60 0C (3 min) 10 0C/min -> 100 0C (3 min) 5 0C/min -> 300 0C
I 235.74233.96233.96235.51237.3
ReferenceReckendorf, 1997Wang, Peng, et al., 1997Chen, 1996Guillen, Iglesias, et al., 1992Paschke, Herbel, et al., 1992
Comment MSDC-RI MSDC-RI MSDC-RI MSDC-RI MSDC-RI
Column type CapillaryCapillaryCapillaryCapillaryCapillary
Active phase CP Sil 8 CBCP Sil 8 CBDB-5DB-5OV-101
Column length (m) 50.50.30.30.
Carrier gas HeHe
Substrate
Column diameter (mm) 0.250.250.320.32
Phase thickness (μm) 0.250.25
Program not specifiednot specifiednot specifiednot specifiednot specified
I 235.6236.4232.86232.96236.2
ReferenceBundt, Herbel, et al., 1991Bundt, Herbel, et al., 1991Naikwadi, Charbonneau, et al., 1987Naikwadi, Charbonneau, et al., 1987Tucminen, Wickstrom, et al., 1986
Comment MSDC-RI MSDC-RI MSDC-RI MSDC-RI MSDC-RI
Column type Capillary
Active phase DB-5
Column length (m) 30.
Carrier gas He
Substrate
Column diameter (mm) 0.25
Phase thickness (μm)
Program not specified
I 233.96
ReferenceTong, Centen, et al., 1985
Comment MSDC-RI

Van Den Dool and Kratz RI, non-polar column, temperature ramp

Data compiled by: NIST Mass Spectrometry Data Center, William E. Wallace, director

Column type CapillaryCapillaryCapillaryCapillaryCapillary
Active phase DB-5DB-5DB-5DB-5DB-5
Column length (m) 30.30.30.30.30.
Carrier gas HeHeHeHeHe
Substrate
Column diameter (mm) 0.250.250.250.250.25
Phase thickness (μm) 0.250.250.250.250.25
Tstart (C) 40.40.40.40.40.
Tend (C) 310.310.310.310.310.
Heat rate (K/min) 4.4.2.4.6.
Initial hold (min)  5.
Final hold (min)
I 1377.31375.41368.51377.31381.8
ReferenceSong, Lai, et al., 2003Song, Lai, et al., 2003Song, Lai, et al., 2003Song, Lai, et al., 2003Song, Lai, et al., 2003
Comment MSDC-RI MSDC-RI MSDC-RI MSDC-RI MSDC-RI
Column type CapillaryCapillaryCapillaryCapillaryCapillary
Active phase DB-1OV-1HP-5MSDB-5DB-5
Column length (m) 30.25.30.30.30.
Carrier gas He  HeHe
Substrate
Column diameter (mm) 0.250.20.250.250.25
Phase thickness (μm) 0.250.330.250.250.25
Tstart (C) 40.100.50.40.40.
Tend (C) 325.180.300.310.310.
Heat rate (K/min) 3.5.10.2.4.
Initial hold (min)
Final hold (min)
I 1338.41392.21387.1368.51377.3
ReferenceSun and Stremple, 2003Zhang, Shen, et al., 2000Nahir, 1999Lai and Song, 1995Lai and Song, 1995
Comment MSDC-RI MSDC-RI MSDC-RI MSDC-RI MSDC-RI
Column type CapillaryCapillaryCapillaryCapillaryCapillary
Active phase DB-5DB-5DB-5SP-2100SP-2100
Column length (m) 30.30.30.
Carrier gas HeHeHeH2H2
Substrate
Column diameter (mm) 0.250.250.25
Phase thickness (μm) 0.250.25
Tstart (C) 40.40.50.170.170.
Tend (C) 310.310.250.
Heat rate (K/min) 6.4.4.2.4.
Initial hold (min)  5.
Final hold (min)
I 1381.81375.41381.1375.781377.20
ReferenceLai and Song, 1995Lai and Song, 1995Gómez, Ledbetter, et al., 1993Podmaniczky, Szepesy, et al., 1986Podmaniczky, Szepesy, et al., 1986
Comment MSDC-RI MSDC-RI MSDC-RI MSDC-RI MSDC-RI
Column type CapillaryCapillaryCapillaryCapillaryCapillary
Active phase SP-2100SP-2100SP-2100SP-2100CP Sil 5 CB
Column length (m)
Carrier gas H2H2H2H2H2
Substrate
Column diameter (mm)
Phase thickness (μm)
Tstart (C) 170.170.170.170.170.
Tend (C)
Heat rate (K/min) 6.2.4.6.4.
Initial hold (min)
Final hold (min)
I 1377.911396.811392.1392.641390.72
ReferencePodmaniczky, Szepesy, et al., 1986Podmaniczky, Szepesy, et al., 1986Podmaniczky, Szepesy, et al., 1986Podmaniczky, Szepesy, et al., 1986Podmaniczky, Szepesy, et al., 1986
Comment MSDC-RI MSDC-RI MSDC-RI MSDC-RI MSDC-RI
Column type CapillaryCapillaryCapillaryCapillaryCapillary
Active phase DB-5SE-30SE-30Methyl SiliconeOV-101
Column length (m) 30.25.25.10.108.
Carrier gas HeN2N2He
Substrate
Column diameter (mm) 0.260.330.330.210.25
Phase thickness (μm) 0.25   0.2
Tstart (C) 50.100.140.60.35.
Tend (C) 300.320.320.210.200.
Heat rate (K/min) 6.10.6.5.1.
Initial hold (min) 4.
Final hold (min) 20.
I 1384.1374.1378.1349.1350.
ReferenceRostad and Pereira, 1986Korhonen and Lind, 1985Korhonen and Lind, 1985Kozloski, 1985Hayes and Pitzer, 1981
Comment MSDC-RI MSDC-RI MSDC-RI MSDC-RI MSDC-RI
Column type CapillaryCapillaryCapillary
Active phase SE-52SE-52SE-52
Column length (m) 33.365.50.
Carrier gas HeN2N2
Substrate
Column diameter (mm) 0.500.3
Phase thickness (μm)
Tstart (C) 50.100.100.
Tend (C) 320.300.300.
Heat rate (K/min) 6.1.82.5
Initial hold (min) 5.
Final hold (min)
I 1364.1373.1362.
ReferenceBeernaert, 1979Carugno and Rossi, 1967Cantuti, Cartoni, et al., 1965
Comment MSDC-RI MSDC-RI MSDC-RI

Normal alkane RI, polar column, custom temperature program

Data compiled by: NIST Mass Spectrometry Data Center, William E. Wallace, director

Column type CapillaryCapillaryCapillaryCapillaryCapillary
Active phase Supelcowax-10Carbowax 20MDB-WaxDB-WaxCarbowax 20M
Column length (m) 30. 30.
Carrier gas He
Substrate
Column diameter (mm) 0.25 0.53
Phase thickness (μm) 0.25 1.0
Program 40C(3min) => 4C/min => 75C => 8C/min => 250C(5min)not specified40 0C (4 min) 4 0C/min -> 200 0C (20 min)not specifiednot specified
I 2012.1981.1974.1974.1981.
ReferenceVichi, Guadayol, et al., 2007Vinogradov, 2004Peng, 1996Peng, Yang, et al., 1991Shibamoto, 1987
Comment MSDC-RI MSDC-RI MSDC-RI MSDC-RI MSDC-RI

Kovats' RI, non-polar column, temperature ramp

Data compiled by: NIST Mass Spectrometry Data Center, William E. Wallace, director

Column type CapillaryCapillaryCapillaryCapillary
Active phase DB-1DB-1DB-1OV-101
Column length (m) 60.60.60.110.
Carrier gas HeHeHeHe
Substrate
Column diameter (mm) 0.320.320.320.25
Phase thickness (μm) 0.250.250.250.20
Tstart (C) 30.30.30.35.
Tend (C) 210.210.210.200.
Heat rate (K/min) 2.2.2.1.
Initial hold (min) 4.4.4.
Final hold (min)
I 1345.1346.1349.1350.
ReferenceTakeoka, Buttery, et al., 1992Takeoka, Buttery, et al., 1992Takeoka, Buttery, et al., 1992Hayes and Pitzer, 1982
Comment MSDC-RI MSDC-RI MSDC-RI MSDC-RI

References

Dorofeeva O.V., 1997
Dorofeeva O.V.,
Unpublished results. Thermocenter of Russian Academy of Science, Moscow, 1997. [all data]
Trevissoi C., 1955
Trevissoi C.,
Specific heat and entropy of biphenyl,
Ann. Chim. (Rome), 1955, 45, 943-959. [all data]
Katon J.E., 1959
Katon J.E.,
The vibrational spectra and geometrical configuration of biphenyl,
Spectrochim. Acta, 1959, 15, 627-650. [all data]
Aleman H., 1973
Aleman H.,
Thermodynamic functions for biphenyl and the 4,4'-dihalogenobiphenyls,
Thermochim. Acta, 1973, 7, 69-73. [all data]
Thermodynamics Research Center, 1997
Thermodynamics Research Center,
Selected Values of Properties of Chemical Compounds., Thermodynamics Research Center, Texas A&M University, College Station, Texas, 1997. [all data]
Chirico R.D., 1989
Chirico R.D.,
The thermodynamic properties of biphenyl,
J. Chem. Thermodyn., 1989, 21, 1307-1331. [all data]
Chirico, Knipmeyer, et al., 1989
Chirico, R.D.; Knipmeyer, S.E.; Nguyen, A.; Steele, W.V.,
The thermodynamic properties of biphenyl,
J. Chem. Thermodyn., 1989, 21, 1307-31. [all data]
Parks and Huffman, 1931
Parks, G.S.; Huffman, H.M.,
Some fusion and transition data for hydrocarbons,
Ind. Eng. Chem., 1931, 23, 1138-9. [all data]
Tsonopoulos and Ambrose, 1995
Tsonopoulos, C.; Ambrose, D.,
Vapor-Liquid Critical Properties of Elements and Compounds. 3. Aromatic Hydrocarbons,
J. Chem. Eng. Data, 1995, 40, 547-558. [all data]
Ellard and Yanko, 1963
Ellard, J.A.; Yanko, W.H.,
, U. S. A. E. C. Rep. IDO-11008, 1963. [all data]
Reiter, 1963
Reiter, R.W.,
, NASA Doc. N63-19495 1963 1963, 1963. [all data]
Mandel and Ewbank, 1960
Mandel, H.; Ewbank, N.,
, Atomics International NAA-S-R-5129 1960, 1960. [all data]
Weast and Grasselli, 1989
CRC Handbook of Data on Organic Compounds, 2nd Editon, Weast,R.C and Grasselli, J.G., ed(s)., CRC Press, Inc., Boca Raton, FL, 1989, 1. [all data]
Buckingham and Donaghy, 1982
Buckingham, J.; Donaghy, S.M.,
Dictionary of Organic Compounds: Fifth Edition, Chapman and Hall, New York, 1982, 1. [all data]
Back, Grzyll, et al., 1996
Back, Dwight D.; Grzyll, Lawrence R.; Corrigan, Mary,
DSC enthalpy of vaporization measurements of high temperature two-phase working fluids,
Thermochimica Acta, 1996, 272, 53-63, https://doi.org/10.1016/0040-6031(95)02615-0
. [all data]
Chirico, Knipmeyer, et al., 1989, 2
Chirico, R.D.; Knipmeyer, S.E.; Nguyen, A.; Steele, W.V.,
The thermodynamic properties of biphenyl,
J. Chem. Thermodyn., 1989, 21, 1307-1331. [all data]
Sakoguchi, Iwai, et al., 1989
Sakoguchi, Akihiro; Iwai, Yoshio; Takenaka, Jun; Arai, Yasuhiko,
Measurement of vapor pressures of tetralin, 1-naphthol and biphenyl using flow-type apparatus.,
KAGAKU KOGAKU RONBUNSHU, 1989, 15, 1, 166-169, https://doi.org/10.1252/kakoronbunshu.15.166
. [all data]
Sasse, N'guimbi, et al., 1989
Sasse, K.; N'guimbi, J.; Jose, J.; Merlin, J.C.,
Tension de vapeur d'hydrocarbures polyaromatiques dans le domaine 10-3--10 Torr,
Thermochimica Acta, 1989, 146, 53-61, https://doi.org/10.1016/0040-6031(89)87075-3
. [all data]
Stephenson and Malanowski, 1987
Stephenson, Richard M.; Malanowski, Stanislaw,
Handbook of the Thermodynamics of Organic Compounds, 1987, https://doi.org/10.1007/978-94-009-3173-2
. [all data]
Nasir, Hwang, et al., 1980
Nasir, P.; Hwang, S.C.; Kobayashi, R.,
Development of an apparatus to measurement vapor pressures at high temperatures and its application to three higher-boiling compounds,
J. Chem. Eng. Data, 1980, 25, 4, 298-301, https://doi.org/10.1021/je60087a009
. [all data]
Glaser and Rüland, 1957
Glaser, Fritz; Rüland, Heinz,
Untersuchungen über Dampfdruckkurven und kritische Daten einiger technisch wichtiger organischer Substanzen,
Chemie Ing. Techn., 1957, 29, 12, 772-775, https://doi.org/10.1002/cite.330291204
. [all data]
Cunningham, 1930
Cunningham, G.V.,
Power, 1930, 72, 374. [all data]
Boublik, Fried, et al., 1984
Boublik, T.; Fried, V.; Hala, E.,
The Vapour Pressures of Pure Substances: Selected Values of the Temperature Dependence of the Vapour Pressures of Some Pure Substances in the Normal and Low Pressure Region, 2nd ed., Elsevier, New York, 1984, 972. [all data]
Cunningham, 1930, 2
Cunningham, G.B.,
Diphenyl (C6H5-C6H5). May Solve Reheating Problem,
Power, 1930, 72, 374-377. [all data]
Nass, Lenoir, et al., 1995
Nass, Karen; Lenoir, Dieter; Kettrup, Antonius,
Calculation of the Thermodynamic Properties of Polycyclic Aromatic Hydrocarbons by an Incremental Procedure,
Angew. Chem. Int. Ed. Engl., 1995, 34, 16, 1735-1736, https://doi.org/10.1002/anie.199517351
. [all data]
Chickos, 1975
Chickos, James Speros,
A simple equilibrium method for determining heats of sublimation,
J. Chem. Educ., 1975, 52, 2, 134-39, https://doi.org/10.1021/ed052p134
. [all data]
Clark, Knox, et al., 1975
Clark, Timothy; Knox, Trevor; Mackle, Henry; McKervey, M. Anthony; Rooney, John J.,
Heats of sublimation of some cage hydrocarbons by a temperature scanning technique,
J. Chem. Soc., Faraday Trans. 1, 1975, 71, 0, 2107, https://doi.org/10.1039/f19757102107
. [all data]
Pribilová and Pouchlý, 1974
Pribilová, J.; Pouchlý, J.,
Vapour pressure of some low-volatile hydrocarbons determined by the effusion method,
Collect. Czech. Chem. Commun., 1974, 39, 5, 1118-1124, https://doi.org/10.1135/cccc19741118
. [all data]
Radchenko and Kitaigorodskii, 1974
Radchenko, L.G.; Kitaigorodskii, A.I.,
The vapour pressures and heats of sublimation of naphthalene, biphenyl, octafluoronaphthalene, decafluorobiphenyl, acenaphthene and α-nitronaphthalene,
Russ. J. Phys. Chem. (Engl. Transl.), 1974, 48, 1595. [all data]
Aihara, 1959
Aihara, A.,
Estimation of the energy of hydrogen bonds formed in crystals. I. Sublimation pressures of some organic molecular crystals and the additivity of lattice energy,
Bull. Chem. Soc. Jpn., 1959, 32, 1242. [all data]
Aihara, 1955
Aihara, A.,
J. Chem. Soc. Jpn. Pure Chem. Sect., 1955, 76, 492. [all data]
Bradley and Cleasby, 1953
Bradley, R.S.; Cleasby, T.G.,
349. The vapour pressure and lattice energy of some aromatic ring compounds,
J. Chem. Soc., 1953, 1690, https://doi.org/10.1039/jr9530001690
. [all data]
Bradley and Cleasby, 1953, 2
Bradley, R.S.; Cleasby, T.G.,
The vapour pressure and lattice energy of some aromatic ring compounds,
J. Am. Chem. Soc., 1953, 1690-16. [all data]
Seki and Suzuki, 1953
Seki, Syûzô; Suzuki, Keisuke,
Physico-Chemical Studies on Molecular Compounds. III. Vapor Pressures of Diphenyl, 4, 4'-Dinitrodiphenyl, and Molecular Compound between Them,
Bull. Chem. Soc. Jpn., 1953, 26, 5, 209-213, https://doi.org/10.1246/bcsj.26.209
. [all data]
Wolf and Weghofer, 1938
Wolf, K.L.; Weghofer, H.Z.,
Z. Phys. Chem. Abt. B, 1938, 39, 194. [all data]
Wolf and Weghofer, 1938, 2
Wolf, K.L.; Weghofer, H.,
Uber sublimationswarmen,
Z. Phys. Chem., 1938, 39, 194-208. [all data]
O'Rourke and Mraw, 1983
O'Rourke, D.F.; Mraw, S.C.,
Heat capacities and enthalpies of fusion of dibenzothiophene (220 to 560 K) and of biphenyl, cyclohexylbenzene, and cyclohexylcyclohexane (220 to 475 K). Enthalpies and temperatures of three transitions in solid cyclohexylcyclohexane,
J. Chem. Thermodynam., 1983, 15, 489-502. [all data]
Smith, 1979
Smith, G.W.,
Phase behavior of some linear polyphenyls,
Mol. Cryst. Liq. Cryst., 1979, 49, 207-209. [all data]
Spaght, Thomas, et al., 1932
Spaght, M.E.; Thomas, S.B.; Parks, G.S.,
Some heat capacity data on organic compounds obtained with a radiation calorimeter,
J. Phys. Chem., 1932, 36, 882-888. [all data]
Khimeche and Dahmani, 2006
Khimeche, K.; Dahmani, A.,
Determination by DSC of solid--liquid diagrams for polyaromatic -- 4,4'diaminodiphenylmethane binary systems,
J Therm Anal Calorim, 2006, 84, 1, 47-52, https://doi.org/10.1007/s10973-005-7167-9
. [all data]
Benkhennouf, Kamel, et al., 2004
Benkhennouf, M.; Kamel, K.; Dahmani, A.,
Solid-liquid phase equilibria for aromatic compounds,
J. Phys. IV France, 2004, 113, 7-9, https://doi.org/10.1051/jp4:20040002
. [all data]
Domalski and Hearing, 1996
Domalski, Eugene S.; Hearing, Elizabeth D.,
Heat Capacities and Entropies of Organic Compounds in the Condensed Phase. Volume III,
J. Phys. Chem. Ref. Data, 1996, 25, 1, 1, https://doi.org/10.1063/1.555985
. [all data]
Ueberreiter and Orthmann, 1950
Ueberreiter, K.; Orthmann, H.-J.,
Specifische Wärme, spezifisches Volumen, Temperatur- und Wärme-leittähigkeit einiger disubstituierter Benzole und polycyclischer Systeme,
Z. Natursforsch. 5a, 1950, 101-108. [all data]
Schmidt, 1941
Schmidt, W.R.,
Thesis Washington University (St. Louis), 1941. [all data]
Eykman, 1889
Eykman, J.F.,
Zur kryoskopischen Molekulargewichtsbestimmung,
Z. Physik. Chem., 1889, 4, 497-519. [all data]
Saito, Atake, et al., 1988
Saito, K.; Atake, T.; Chihara, H.,
Incommensurate phase transitions and anomalous lattice heat capacities of biphenyl,
Bull. Chem. Soc. Japan, 1988, 61, 679-688. [all data]
Atake, Saito, et al., 1983
Atake, T.; Saito, K.; Chihara, H.,
Low temperature heat capacities of 1,1'-biphenyl and 1,1'-biphenyl-d10,
Chem. Lett., 1983, (4), 493-496. [all data]
Ataki and Chihara, 1980
Ataki, T.; Chihara, H.,
Heat capacity anomalies due to successive phase transitions in 1,1'-biphenyl,
Solid State Commun., 1980, 35, 131-134. [all data]
Wasicki, Radomska, et al., 1982
Wasicki, J.; Radomska, M.; Radomski, R.,
Heat capacities of diphenyl, p-terphenyl and p-quaterphenyl from 180 K to their melting points,
J. Therm. Anal., 1982, 25, 509-514. [all data]
Mackay, Shiu, et al., 1979
Mackay, D.; Shiu, W.-Y.; Sutherland, R.P.,
Determination of Air-Water Henry's Law Constants for Hydrophobic Pollutants,
Environ. Sci. Technol., 1979, 13, 333-337. [all data]
Bohon and Claussen, 1951
Bohon, R.L.; Claussen, W.F.,
The solubility of aromatic hydrocarbons in water,
J. Am. Chem. Soc., 1951, 73, 1571-1578. [all data]