Butanedioic acid, dipropyl ester
- Formula: C10H18O4
- Molecular weight: 202.2475
- IUPAC Standard InChIKey: SZHZCPHKDJWHNG-UHFFFAOYSA-N
- CAS Registry Number: 925-15-5
- Chemical structure:
View 3d structure (requires JavaScript / HTML 5) - Other names: Succinic acid, dipropyl ester; Di-n-propyl succinate; Dipropyl succinate; Dipropylester kyseliny jantarove; Dipropyl butanedioate

Phase change data

Data compiled as indicated in comments:
BS - Robert L. Brown and Stephen E. Stein
TRC - Thermodynamics Research Center, NIST Boulder Laboratories, Chris Muzny director
AC - William E. Acree, Jr., James S. Chickos
Quantity | Value | Units | Method | Reference | Comment |
---|---|---|---|---|---|
Tboil | 523. to 525. | K | N/A | Frinton Laboratories Inc., 1986 | BS |
Tboil | 521. | K | N/A | Timmermans, 1927 | Uncertainty assigned by TRC = 1.5 K; source of data not celar; TRC |
Enthalpy of vaporization
ΔvapH (kJ/mol) | Temperature (K) | Method | Reference | Comment |
---|---|---|---|---|
59.4 | 365. | A | Stephenson and Malanowski, 1987 | Based on data from 350. to 524. K. See also Stull, 1947.; AC |
Antoine Equation Parameters
log10(P) = A − (B / (T + C))
P = vapor pressure (bar)
T = temperature (K)
View plot Requires a JavaScript / HTML 5 canvas capable browser.
Temperature (K) | A | B | C | Reference | Comment |
---|---|---|---|---|---|
350.7 to 524.0 | 5.26245 | 2572.141 | -34.746 | Stull, 1947 | Coefficents calculated by NIST from author's data. |

Kovats' RI, non-polar column, isothermal

Column type | Active phase | Temperature (C) | I | Reference | Comment |
---|---|---|---|---|---|
Packed | SE-30 | 220. | 1357. | Zulaïca and Guiochon, 1963 | Column length: 2. m |

Normal alkane RI, non-polar column, isothermal

Column type | Active phase | Temperature (C) | I | Reference | Comment |
---|---|---|---|---|---|
Capillary | OV-101 | 130. | 1338. | Lipp, Krasnykh, et al., 2008 | Helium; Column length: 50. m; Column diameter: 0.25 mm |
Capillary | OV-101 | 140. | 1339. | Lipp, Krasnykh, et al., 2008 | Helium; Column length: 50. m; Column diameter: 0.25 mm |
Capillary | OV-101 | 150. | 1336. | Lipp, Krasnykh, et al., 2008 | Helium; Column length: 50. m; Column diameter: 0.25 mm |
Capillary | OV-101 | 160. | 1338. | Lipp, Krasnykh, et al., 2008 | Helium; Column length: 50. m; Column diameter: 0.25 mm |
Capillary | OV-101 | 220. | 1357. | Lipp, Krasnykh, et al., 2008 | Helium; Column length: 50. m; Column diameter: 0.25 mm |

Normal alkane RI, non-polar column, temperature ramp

Column type | Active phase | I | Reference | Comment |
---|---|---|---|---|
Capillary | Ultra-1 | 1336. | Okumura, 1991 | 25. m/0.32 mm/0.25 μm, He, 3. K/min; Tstart: 80. C; Tend: 260. C |

References

Frinton Laboratories Inc., 1986
Frinton Laboratories Inc.,
Catalog Number 11, Frinton Laboratories Inc., Vineland, NJ, 1986, 99. [all data]
Timmermans, 1927
Timmermans, J.,
The Melting Point of Organic Substances,
Bull. Soc. Chim. Belg., 1927, 36, 502. [all data]
Stephenson and Malanowski, 1987
Stephenson, Richard M.; Malanowski, Stanislaw,
Handbook of the Thermodynamics of Organic Compounds, 1987, https://doi.org/10.1007/978-94-009-3173-2
. [all data]
Stull, 1947
Stull, Daniel R.,
Vapor Pressure of Pure Substances. Organic and Inorganic Compounds,
Ind. Eng. Chem., 1947, 39, 4, 517-540, https://doi.org/10.1021/ie50448a022
. [all data]
Zulaïca and Guiochon, 1963
Zulaïca, J.; Guiochon, G.,
Séparation et identification de di-esters aliphatiques et aromatiques et de trimesters phosphoriques par chromatographie en phase gazeuse,
Bull. Soc. Chim. Fr., 1963, 6, 1242-1252. [all data]
Lipp, Krasnykh, et al., 2008
Lipp, S.V.; Krasnykh, E.L.; Levanova, S.V.,
Retention indices of symmetrical dicarboxylic acid esters,
Rus. J. Anal. Chem., 2008, 63, 4, 349-352, https://doi.org/10.1134/S1061934808040072
. [all data]
Okumura, 1991
Okumura, T.,
retention indices of environmental chemicals on methyl silicone capillary column,
Journal of Environmental Chemistry (Japan), 1991, 1, 2, 333-358, https://doi.org/10.5985/jec.1.333
. [all data]