propyl hydrogen maleate
- IUPAC Standard InChIKey: AYAUWVRAUCDBFR-ARJAWSKDSA-N
- CAS Registry Number: 925-03-1
- Chemical structure:
View 3d structure (requires JavaScript / HTML 5) - Permanent link for this species. Use this link for bookmarking this species for future reference.

Reaction thermochemistry data

Data compiled by: Hussein Y. Afeefy, Joel F. Liebman, and Stephen E. Stein
Individual Reactions
By formula: C4H2O3 + C3H8O = propyl hydrogen maleate
Quantity | Value | Units | Method | Reference | Comment |
---|---|---|---|---|---|
ΔrH° | -35. | kJ/mol | Kin | Tribunescu, Poraicu, et al., 1978 | liquid phase |

References

Tribunescu, Poraicu, et al., 1978
Tribunescu, P.; Poraicu, M.; Merca, E.; Facsko, O.,
Kinetics of mono-N-propylmaleate synthesis,
Bull. Stiint. Teh. Inst. Politeh. "Traian Vuia" Timisoara, Ser. Chim., 1978, 23, 147-151. [all data]