Ethanol, 2-(ethylphenylamino)-
- Formula: C10H15NO
- Molecular weight: 165.2322
- IUPAC Standard InChIKey: HYVGFUIWHXLVNV-UHFFFAOYSA-N
- CAS Registry Number: 92-50-2
- Chemical structure:
View 3d structure (requires JavaScript / HTML 5) - Other names: Ethanol, 2-(N-ethylanilino)-; β-(Ethylanilino)ethyl alcohol; Ethyl(β-hydroxyethyl)aniline; Ethylphenylethanolamine; Hydroxyethylethylaniline; N-(2-Hydroxyethyl)-N-ethylaniline; N-Ethyl(β-hydroxyethyl)aniline; N-Ethyl-N-(β-hydroxyethyl)aniline; N-Ethyl-N-(hydroxyethyl)aniline; N-Ethyl-N-(2-hydroxyethyl)aniline; N-Ethyl-N-phenylaminoethanol; N-Ethyl-N-phenylethanolamine; N-Ethylanilinoethanol; Phenylethylethanolamine; 2-(Ethylphenylamino)ethanol; 2-(N-Ethyl-N-phenylamino)ethanol; 2-(N-Ethylanilino)ethanol; N-Phenyl-N-ethylethanolamine; N-Phenyl-N-ethyl-2-aminoethanol; NSC 7485

Phase change data

Data compiled by: Robert L. Brown and Stephen E. Stein
Reduced pressure boiling point
Tboil (K) | Pressure (bar) | Reference |
---|---|---|
424. | 0.019 | Frinton Laboratories Inc., 1986 |

Van Den Dool and Kratz RI, non-polar column, temperature ramp

Column type | Active phase | I | Reference | Comment |
---|---|---|---|---|
Capillary | OV-1 | 1416.7 | Gautzsch and Zinn, 1996 | 8. K/min; Tstart: 35. C; Tend: 300. C |

References

Frinton Laboratories Inc., 1986
Frinton Laboratories Inc.,
Catalog Number 11, Frinton Laboratories Inc., Vineland, NJ, 1986, 99. [all data]
Gautzsch and Zinn, 1996
Gautzsch, R.; Zinn, P.,
Use of incremental models to estimate the retention indexes of aromatic compounds,
Chromatographia, 1996, 43, 3/4, 163-176, https://doi.org/10.1007/BF02292946
. [all data]