Nitric acid, 1-methylpropyl ester
- Formula: C4H9NO3
- Molecular weight: 119.1192
- IUPAC Standard InChIKey: DYONNFFVDNILGI-UHFFFAOYSA-N
- CAS Registry Number: 924-52-7
- Chemical structure:
View 3d structure (requires JavaScript / HTML 5) - Species with the same structure:
- Other names: sec-Butyl Nitrate; Nitric acid, sec-butyl ester; 2-Butyl nitrate; C2H5CH(CH3)ONO2

Phase change data

Data compiled by: Thermodynamics Research Center, NIST Boulder Laboratories, Chris Muzny director
Quantity | Value | Units | Method | Reference | Comment |
---|---|---|---|---|---|
Tboil | 397.15 | K | N/A | Kornblum, Patton, et al., 1948 | Uncertainty assigned by TRC = 2. K |

Henry's Law data

Data compiled by: Rolf Sander
Henry's Law constant (water solution)
kH(T) = k°H exp(d(ln(kH))/d(1/T) ((1/T) - 1/(298.15 K)))
k°H = Henry's law constant for solubility in water at 298.15 K (mol/(kg*bar))
d(ln(kH))/d(1/T) = Temperature dependence constant (K)
k°H (mol/(kg*bar)) | d(ln(kH))/d(1/T) (K) | Method | Reference |
---|---|---|---|
0.65 | 5400. | M | N/A |
0.65 | 5600. | M | N/A |

Normal alkane RI, non-polar column, temperature ramp

Column type | Active phase | I | Reference | Comment |
---|---|---|---|---|
Capillary | DB-1 | 739. | Schneider and Ballschniter, 1996 | 40. C @ 3. min, 3. K/min; Tend: 250. C |

References

Kornblum, Patton, et al., 1948
Kornblum, N.; Patton, J.T.; Nordmann, J.B.,
The Basis for the Reported Optical Activity of the Salts of Aliphatic Nitro Compounds: 2-Nitrobutane,
J. Am. Chem. Soc., 1948, 70, 746. [all data]
Schneider and Ballschniter, 1996
Schneider, M.; Ballschniter, K.,
Separation of Diastereomeric and Enentiomeric Alkyl Nitrates - Systematic Approach to Chiral Discrimination on Cyclodextrin LIPODEX-D,
Chem. Eur. J., 1996, 2, 5, 539-544, https://doi.org/10.1002/chem.19960020513
. [all data]