1-Propanamine, N-methyl-N-nitroso-
- Formula: C4H10N2O
- Molecular weight: 102.1350
- IUPAC Standard InChIKey: ITBDKUCVKYSWMF-UHFFFAOYSA-N
- CAS Registry Number: 924-46-9
- Chemical structure:
View 3d structure (requires JavaScript / HTML 5) - Other names: Propylamine, N-methyl-N-nitroso-; Methylpropylnitrosamine; N-Methyl-N-nitrosopropylamine; N-Nitrosomethyl-n-propylamine; N-Nitroso methyl propylamine; N-Methyl-N-nitroso-1-propanamine; Methylpropylnitrosoamine; Methyl-n-propylnitrosamine; MPN; Nitrosomethyl-n-propylamine; Nitrosomethylpropylamine; N-Nitroso-N-methylpropylamine

Normal alkane RI, non-polar column, temperature ramp

Column type | Active phase | I | Reference | Comment |
---|---|---|---|---|
Capillary | OV-101 | 887. | Zenkevich, 2005 | 25. m/0.20 mm/0.10 μm, N2/He, 6. K/min; Tstart: 50. C; Tend: 250. C |

References

Zenkevich, 2005
Zenkevich, I.G.,
Experimentally measured retention indices., 2005. [all data]