sec-Butyl nitrite
- Formula: C4H9NO2
- Molecular weight: 103.1198
- IUPAC Standard InChIKey: NFGNZNFBQAGBJA-UHFFFAOYSA-N
- CAS Registry Number: 924-43-6
- Chemical structure:
View 3d structure (requires JavaScript / HTML 5) - Species with the same structure:
- Other names: Nitrous acid, 1-methylpropyl ester; Nitrous acid, sec-butyl ester; CH3CH2CH(CH3)ONO; 2-Butyl nitrite

Gas phase thermochemistry data

Data compiled by: Hussein Y. Afeefy, Joel F. Liebman, and Stephen E. Stein
Quantity | Value | Units | Method | Reference | Comment |
---|---|---|---|---|---|
ΔfH°gas | -153. ± 4.2 | kJ/mol | Ccb | Batt, Christie, et al., 1974 |

Condensed phase thermochemistry data

Data compiled by: Hussein Y. Afeefy, Joel F. Liebman, and Stephen E. Stein
Quantity | Value | Units | Method | Reference | Comment |
---|---|---|---|---|---|
ΔfH°liquid | -188. | kJ/mol | Ccb | Batt, Christie, et al., 1974 | |
Quantity | Value | Units | Method | Reference | Comment |
ΔcH°liquid | -2672. ± 0.8 | kJ/mol | Ccb | Batt, Christie, et al., 1974 |

Phase change data

Data compiled as indicated in comments:
BS - Robert L. Brown and Stephen E. Stein
TRC - Thermodynamics Research Center, NIST Boulder Laboratories, Chris Muzny director
ALS - Hussein Y. Afeefy, Joel F. Liebman, and Stephen E. Stein
AC - William E. Acree, Jr., James S. Chickos
Quantity | Value | Units | Method | Reference | Comment |
---|---|---|---|---|---|
Tboil | 340. to 342. | K | N/A | Frinton Laboratories Inc., 1986 | BS |
Tboil | 341.5 | K | N/A | Kornblum, Smiley, et al., 1955 | Uncertainty assigned by TRC = 0.5 K; TRC |
Tboil | 341.15 | K | N/A | Kornblum, Patton, et al., 1948 | Uncertainty assigned by TRC = 1.5 K; TRC |
Quantity | Value | Units | Method | Reference | Comment |
ΔvapH° | 35. | kJ/mol | E | Batt, Christie, et al., 1974 | ALS |
Enthalpy of vaporization
ΔvapH (kJ/mol) | Temperature (K) | Method | Reference | Comment |
---|---|---|---|---|
29.6 | 277. | A | Stephenson and Malanowski, 1987 | Based on data from 267. to 287. K. See also Thompson and Dainton, 1937.; AC |

Normal alkane RI, non-polar column, temperature ramp

Column type | Active phase | I | Reference | Comment |
---|---|---|---|---|
Capillary | OV-101 | 542. | Zenkevich, 2005 | 25. m/0.20 mm/0.10 μm, N2/He, 6. K/min; Tstart: 50. C; Tend: 250. C |

Normal alkane RI, polar column, custom temperature program

Column type | Active phase | I | Reference | Comment |
---|---|---|---|---|
Packed | Carbowax 6M | 730. | Zenkevich and Malamakhov, 1984 | Nitrogen, Chromaton N AW (0.25-0.315 mm); Column length: 2. m; Program: not specified |

References

Batt, Christie, et al., 1974
Batt, L.; Christie, K.; Milne, R.T.; Summers, A.J.,
Heats of formation of C1-C4 alkyl nitrites (RONO) and their RO-NO bond dissociation energies,
Int. J. Chem. Kinet., 1974, 6, 877-886. [all data]
Frinton Laboratories Inc., 1986
Frinton Laboratories Inc.,
Catalog Number 11, Frinton Laboratories Inc., Vineland, NJ, 1986, 99. [all data]
Kornblum, Smiley, et al., 1955
Kornblum, N.; Smiley, R.A.; Ungnade, H.E.; White, A.M.; Taub, B.,
The reaction of silver nitrite with secondary and tertiary alkyl halides,
J. Am. Chem. Soc., 1955, 77, 5528-33. [all data]
Kornblum, Patton, et al., 1948
Kornblum, N.; Patton, J.T.; Nordmann, J.B.,
The Basis for the Reported Optical Activity of the Salts of Aliphatic Nitro Compounds: 2-Nitrobutane,
J. Am. Chem. Soc., 1948, 70, 746. [all data]
Stephenson and Malanowski, 1987
Stephenson, Richard M.; Malanowski, Stanislaw,
Handbook of the Thermodynamics of Organic Compounds, 1987, https://doi.org/10.1007/978-94-009-3173-2
. [all data]
Thompson and Dainton, 1937
Thompson, H.W.; Dainton, F.S.,
The photochemistry of alkyl nitrites. III,
Trans. Faraday Soc., 1937, 33, 1546, https://doi.org/10.1039/tf9373301546
. [all data]
Zenkevich, 2005
Zenkevich, I.G.,
Experimentally measured retention indices., 2005. [all data]
Zenkevich and Malamakhov, 1984
Zenkevich, I.G.; Malamakhov, A.S.,
Group Chromato Mass Spectrometric Identification of Alkylnitrites,
Zh. Anal. Khim. (Rus), 1984, 39, 10, 1864-1868. [all data]