1,2,4-butanetricarboxylic acid
- Formula: C7H10O6
- Molecular weight: 190.1507
- IUPAC Standard InChIKey: LOGBRYZYTBQBTB-UHFFFAOYSA-N
- CAS Registry Number: 923-42-2
- Chemical structure:
View 3d structure (requires JavaScript / HTML 5) - Permanent link for this species. Use this link for bookmarking this species for future reference.

Phase change data

Data compiled by: Thermodynamics Research Center, NIST Boulder Laboratories, Chris Muzny director
Quantity | Value | Units | Method | Reference | Comment |
---|---|---|---|---|---|
Tfus | 395. | K | N/A | Anonymous, 1957 | Uncertainty assigned by TRC = 1.5 K |

References

Anonymous, 1957
Anonymous, R.,
, Am. Pet. Inst. Res. Proj. 6, Carnegie-Mellon Univ., 1957. [all data]