triethylindium
- Formula: C6H15In
- Molecular weight: 202.001
- IUPAC Standard InChIKey: OTRPZROOJRIMKW-UHFFFAOYSA-N
- CAS Registry Number: 923-34-2
- Chemical structure:
View 3d structure (requires JavaScript / HTML 5) - Permanent link for this species. Use this link for bookmarking this species for future reference.

Condensed phase thermochemistry data

Data compiled by: Eugene S. Domalski and Elizabeth D. Hearing
Constant pressure heat capacity of liquid
Cp,liquid (J/mol*K) | Temperature (K) | Reference | Comment |
---|---|---|---|
297.27 | 298.15 | Maslova, Novoselova, et al., 1973 | T = 60 to 300 K. |

Phase change data

Data compiled as indicated in comments:
TRC - Thermodynamics Research Center, NIST Boulder Laboratories, Chris Muzny director
AC - William E. Acree, Jr., James S. Chickos
DH - Eugene S. Domalski and Elizabeth D. Hearing
Quantity | Value | Units | Method | Reference | Comment |
---|---|---|---|---|---|
Ttriple | 237.6 | K | N/A | Maslova, Novoselova, et al., 1973, 2 | Uncertainty assigned by TRC = 0.2 K; TRC |
Ttriple | 237.6 | K | N/A | Maslova and Faminskaya, 1972 | Uncertainty assigned by TRC = 0.2 K; TRC |
Enthalpy of vaporization
ΔvapH (kJ/mol) | Temperature (K) | Reference | Comment |
---|---|---|---|
45.0 ± 0.7 | 351. | Baev, 2001 | Based on data from 326. to 376. K. See also Baev and Chernyak, 2001.; AC |
Enthalpy of fusion
ΔfusH (kJ/mol) | Temperature (K) | Reference | Comment |
---|---|---|---|
13.012 | 237.6 | Maslova, Novoselova, et al., 1973 | DH |
13.09 | 237.6 | Domalski and Hearing, 1996 | AC |
13.01 | 237.6 | Domalski and Hearing, 1996 | AC |
Entropy of fusion
ΔfusS (J/mol*K) | Temperature (K) | Reference | Comment |
---|---|---|---|
54.77 | 237.6 | Maslova, Novoselova, et al., 1973 | DH |

References

Maslova, Novoselova, et al., 1973
Maslova, V.A.; Novoselova, N.V.; Moseeva, E.M.; Berezhnaya, N.D.; Rabinovich, I.B.,
Specific heat and phase changes of triethylindium, triethyl antimony, and trimethyl gallium,
Trudy. Khim. Khim. Tekhnol., 1973, (2), 51-52. [all data]
Maslova, Novoselova, et al., 1973, 2
Maslova, V.A.; Novoselova, N.V.; Moseeva, E.M.; Berezhnaya, N.D.; Rabinovich, I.B.,
Specific Heat and Phase Changes of Triethylindium, Triethylantimony, and Trimethylgallium,
Tr. Khim. Khim. Tekhnol., 1973, 1973, 51. [all data]
Maslova and Faminskaya, 1972
Maslova, V.A.; Faminskaya, L.A.,
Specific heat and phase changes of triethylarsine and triethylgallium,
Tr. Khim. Khim. Tekhnol., 1972, 1972, 51. [all data]
Baev, 2001
Baev, A.K.,
Izv. Vyssh. Uchebn. Zaved., Khim. Khim. Tekhnol., 2001, 44, 1, 3. [all data]
Baev and Chernyak, 2001
Baev, A.K.; Chernyak, I.N.,
Zh. Neorg. Khim., 2001, 46, 2, 361. [all data]
Domalski and Hearing, 1996
Domalski, Eugene S.; Hearing, Elizabeth D.,
Heat Capacities and Entropies of Organic Compounds in the Condensed Phase. Volume III,
J. Phys. Chem. Ref. Data, 1996, 25, 1, 1, https://doi.org/10.1063/1.555985
. [all data]