Ethene, 1,1-dimethoxy-
- Formula: C4H8O2
- Molecular weight: 88.1051
- IUPAC Standard InChIKey: FJTRNRFAIZEJJJ-UHFFFAOYSA-N
- CAS Registry Number: 922-69-0
- Chemical structure:
View 3d structure (requires JavaScript / HTML 5) - Permanent link for this species. Use this link for bookmarking this species for future reference.

Gas phase thermochemistry data

Data compiled by: Hussein Y. Afeefy, Joel F. Liebman, and Stephen E. Stein
Quantity | Value | Units | Method | Reference | Comment |
---|---|---|---|---|---|
ΔfH°gas | -280.7 ± 3.8 | kJ/mol | Cm | Guthrie and Liu, 1995 | Heat of hydrolysis |

Condensed phase thermochemistry data

Data compiled by: Hussein Y. Afeefy, Joel F. Liebman, and Stephen E. Stein
Quantity | Value | Units | Method | Reference | Comment |
---|---|---|---|---|---|
ΔfH°liquid | -316.1 ± 3.6 | kJ/mol | Cm | Guthrie and Liu, 1995 | Heat of hydrolysis |

Phase change data

Data compiled as indicated in comments:
ALS - Hussein Y. Afeefy, Joel F. Liebman, and Stephen E. Stein
DRB - Donald R. Burgess, Jr.
AC - William E. Acree, Jr., James S. Chickos
Quantity | Value | Units | Method | Reference | Comment |
---|---|---|---|---|---|
ΔvapH° | 35.4 ± 1.2 | kJ/mol | V | Guthrie and Liu, 1995 | Heat of hydrolysis; ALS |
ΔvapH° | 35.4 | kJ/mol | N/A | Guthrie and Liu, 1995 | DRB |
Enthalpy of vaporization
ΔvapH (kJ/mol) | Temperature (K) | Reference | Comment |
---|---|---|---|
39.6 | 333. | Guthrie and Liu, 1995, 2 | Based on data from 303. to 362. K.; AC |

Reaction thermochemistry data

Data compiled by: Hussein Y. Afeefy, Joel F. Liebman, and Stephen E. Stein
Individual Reactions
By formula: 2H2O + C4H8O2 = C2H4O2 + 2CH4O
Quantity | Value | Units | Method | Reference | Comment |
---|---|---|---|---|---|
ΔrH° | -74.4 ± 3.6 | kJ/mol | Cm | Guthrie and Liu, 1995 | liquid phase; Heat of hydrolysis |

Gas phase ion energetics data

Data evaluated by: Edward P. Hunter and Sharon G. Lias
Quantity | Value | Units | Method | Reference | Comment |
---|---|---|---|---|---|
Proton affinity (review) | 957.0 | kJ/mol | N/A | Hunter and Lias, 1998 | |
Quantity | Value | Units | Method | Reference | Comment |
Gas basicity | 928.1 | kJ/mol | N/A | Hunter and Lias, 1998 |

References

Guthrie and Liu, 1995
Guthrie, J.P.; Liu, Z.,
The enols of acetic acid and methyl acetate,
Can. J. Chem., 1995, 73, 1395-2398. [all data]
Guthrie and Liu, 1995, 2
Guthrie, J.P.; Liu, Z.,
The enols of acetic acid and methyl acetate,
Can. J. Chem., 1995, 73, 1395-1398. [all data]
Hunter and Lias, 1998
Hunter, E.P.; Lias, S.G.,
Evaluated Gas Phase Basicities and Proton Affinities of Molecules: An Update,
J. Phys. Chem. Ref. Data, 1998, 27, 3, 413-656, https://doi.org/10.1063/1.556018
. [all data]
Tada, et al., 1972
Tada, M., et al.,
Tetrahedron, 1972, 28, 2121. [all data]