Hydrazine, 1,1-bis(1-methylethyl)-
- Formula: C6H16N2
- Molecular weight: 116.2046
- IUPAC Standard InChIKey: CDLZUDXUPFCTRJ-UHFFFAOYSA-N
- CAS Registry Number: 921-14-2
- Chemical structure:
View 3d structure (requires JavaScript / HTML 5) - Other names: Hydrazine, 1,1-diisopropyl-; 1,1-Diisopropylhydrazine; N,N-Diisopropylhydrazine

Normal alkane RI, non-polar column, temperature ramp

Column type | Active phase | I | Reference | Comment |
---|---|---|---|---|
Capillary | OV-101 | 833. | Zenkevich, 2005 | 25. m/0.20 mm/0.10 μm, N2/He, 6. K/min; Tstart: 50. C; Tend: 250. C |

Normal alkane RI, non-polar column, custom temperature program

Column type | Active phase | I | Reference | Comment |
---|---|---|---|---|
Capillary | Methyl Silicone | 835. | Zenkevich and Kuznetsova, 1990 | Program: not specified |

References

Zenkevich, 2005
Zenkevich, I.G.,
Experimentally measured retention indices., 2005. [all data]
Zenkevich and Kuznetsova, 1990
Zenkevich, I.G.; Kuznetsova, L.M.,
Logic Criteria on Prediction of Gas Chromatographic Retention Indices from Physico-Chemical Properties of Organic Compounds,
Dokl. Akad. Nauk SSSR, 1990, 315, 4, 881-885. [all data]