4-Phenylpyrocatechol
- Formula: C12H10O2
- Molecular weight: 186.2066
- IUPAC Standard InChIKey: QDNPCYCBQFHNJC-UHFFFAOYSA-N
- CAS Registry Number: 92-05-7
- Chemical structure:
View 3d structure (requires JavaScript / HTML 5) - Other names: [1,1'-Biphenyl]-3,4-diol; 1,2-Benzenediol, 4-phenyl-; 3,4-Biphenyldiol; 3,4-Dihydroxybiphenyl; 4-Phenyl-1,2-benzenediol; 4-Phenylcatechol; Biphenyl, 3,4-dihydroxy; biphenyl-3,4-diol

Phase change data

Data compiled by: Robert L. Brown and Stephen E. Stein
Quantity | Value | Units | Method | Reference | Comment |
---|---|---|---|---|---|
Tfus | 412. to 413. | K | N/A | Buckingham and Donaghy, 1982 |
Reduced pressure boiling point
Tboil (K) | Pressure (bar) | Reference |
---|---|---|
476. to 478. | 0.017 | Buckingham and Donaghy, 1982 |

Kovats' RI, non-polar column, isothermal

Column type | Active phase | Temperature (C) | I | Reference | Comment |
---|---|---|---|---|---|
Packed | OV-101 | 197. | 1918. | Dufek, Pacáková, et al., 1981 | N2, Chromaton N Super (0,125-0,16 mm); Column length: 2. m |

References

Buckingham and Donaghy, 1982
Buckingham, J.; Donaghy, S.M.,
Dictionary of Organic Compounds: Fifth Edition, Chapman and Hall, New York, 1982, 1. [all data]
Dufek, Pacáková, et al., 1981
Dufek, P.; Pacáková, V.; Zivný, K.,
Gas chromatographic behaviour of mono- and dihydroxybiphenyls on various silicone phases,
J. Chromatogr., 1981, 211, 1, 150-154, https://doi.org/10.1016/S0021-9673(00)81184-X
. [all data]