1-Propanamine, 3-(triethoxysilyl)-
- Formula: C9H23NO3Si
- Molecular weight: 221.3693
- IUPAC Standard InChIKey: WYTZZXDRDKSJID-UHFFFAOYSA-N
- CAS Registry Number: 919-30-2
- Chemical structure:
View 3d structure (requires JavaScript / HTML 5) - Other names: Propylamine, 3-(triethoxysilyl)-; (γ-Aminopropyl)triethoxysilane; (3-Aminopropyl)triethoxysilane; A 1100; A 1112; AGM 9; Silane 1100; Triethoxy(3-Aminopropyl)silane; UC-A 1100; 3-(Triethoxysilyl)-1-Propanamine; 3-(Triethoxysilyl)propylamine; APTES; NUCA 1100; Silane, (γ-aminopropyl)triethoxy-; Silane, (3-aminopropyl)triethoxy-; Silicone A-1100; AMEO; Aminopropyltriethoxysilane; C 50752; Dynasylan AMEO; Dynasylan AMEO-P; Prosil 220; Triethoxyaminopropylsilane; Union Carbide A-1100; NSC 95428

Phase change data

Data compiled by: Robert L. Brown and Stephen E. Stein
Quantity | Value | Units | Method | Reference | Comment |
---|---|---|---|---|---|
Tboil | 490. | K | N/A | Buckingham and Donaghy, 1982 |
Reduced pressure boiling point
Tboil (K) | Pressure (bar) | Reference |
---|---|---|
395. to 396. | 0.041 | PCR Inc., 1990 |
380. | 0.016 | Buckingham and Donaghy, 1982 |

References

Buckingham and Donaghy, 1982
Buckingham, J.; Donaghy, S.M.,
Dictionary of Organic Compounds: Fifth Edition, Chapman and Hall, New York, 1982, 1. [all data]
PCR Inc., 1990
PCR Inc.,
Research Chemicals Catalog 1990-1991, PCR Inc., Gainesville, FL, 1990, 1. [all data]