Pentane, 3-chloro-3-methyl-
- Formula: C6H13Cl
- Molecular weight: 120.620
- IUPAC Standard InChIKey: SGWJUIFOPCZXMR-UHFFFAOYSA-N
- CAS Registry Number: 918-84-3
- Chemical structure:
View 3d structure (requires JavaScript / HTML 5) - Other names: Diethylmethylcarbinyl chloride; 1-Ethyl-1-methylpropyl chloride; 3-Chloro-3-methylpentane; 3-Methyl-3-chloropentane

Condensed phase thermochemistry data

Data compiled by: Hussein Y. Afeefy, Joel F. Liebman, and Stephen E. Stein
Quantity | Value | Units | Method | Reference | Comment |
---|---|---|---|---|---|
ΔfH°liquid | -260. ± 3. | kJ/mol | Cm | Arnett and Pienta, 1980 | Hydrochlorination |

Phase change data

Data compiled as indicated in comments:
TRC - Thermodynamics Research Center, NIST Boulder Laboratories, Chris Muzny director
BS - Robert L. Brown and Stephen E. Stein
Quantity | Value | Units | Method | Reference | Comment |
---|---|---|---|---|---|
Tboil | 341.65 | K | N/A | Whitmore and Badertscher, 1933 | Uncertainty assigned by TRC = 3. K; TRC |
Reduced pressure boiling point
Tboil (K) | Pressure (bar) | Reference | Comment |
---|---|---|---|
388.7 | 1.01 | Aldrich Chemical Company Inc., 1990 | BS |

Reaction thermochemistry data

Data compiled by: Hussein Y. Afeefy, Joel F. Liebman, and Stephen E. Stein
Individual Reactions
By formula: HCl + C6H12 = C6H13Cl
Quantity | Value | Units | Method | Reference | Comment |
---|---|---|---|---|---|
ΔrH° | -67.2 ± 1.9 | kJ/mol | Cm | Arnett and Pienta, 1980 | liquid phase; solvent: Methylene chloride; Hydrochlorination |
By formula: C6H12 + HCl = C6H13Cl
Quantity | Value | Units | Method | Reference | Comment |
---|---|---|---|---|---|
ΔrH° | -58.9 ± 2.0 | kJ/mol | Cm | Arnett and Pienta, 1980 | liquid phase; solvent: Methylene chloride; Hydrochlorination |
By formula: C6H13Cl = C6H13Cl
Quantity | Value | Units | Method | Reference | Comment |
---|---|---|---|---|---|
ΔrH° | 2.8 ± 0.3 | kJ/mol | Eqk | Andreevskii, Kabo, et al., 1974 | liquid phase; Isomerization |

Kovats' RI, non-polar column, isothermal

Column type | Active phase | Temperature (C) | I | Reference | Comment |
---|---|---|---|---|---|
Packed | Apiezon L | 100. | 840. | Castello and D'Amato, 1986 | |
Packed | Apiezon L | 125. | 841. | Castello and D'Amato, 1986 | |
Packed | Apiezon L | 75. | 839. | Castello and D'Amato, 1986 |

Kovats' RI, polar column, isothermal

Column type | Active phase | Temperature (C) | I | Reference | Comment |
---|---|---|---|---|---|
Packed | Carbowax 20M | 100. | 944. | Castello and D'Amato, 1986 | He, Chromosorb W AW DMC; Column length: 3. m |
Packed | Carbowax 20M | 125. | 956. | Castello and D'Amato, 1986 | He, Chromosorb W AW DMC; Column length: 3. m |
Packed | Carbowax 20M | 75. | 939. | Castello and D'Amato, 1986 | He, Chromosorb W AW DMC; Column length: 3. m |

References

Arnett and Pienta, 1980
Arnett, E.M.; Pienta, N.J.,
Stabilities of carbonium ions in solution. 12. Heats of formation of alkyl chlorides as an entree to heats of solvation of aliphatic carbonium ions,
J. Am. Chem. Soc., 1980, 102, 3329-3334. [all data]
Whitmore and Badertscher, 1933
Whitmore, F.C.; Badertscher, D.E.,
The Yields of Some Aliphatic Tertiary Grignard Reagents and the Limits of their Usefulness as Synthetic Reagents,
J. Am. Chem. Soc., 1933, 55, 1559. [all data]
Aldrich Chemical Company Inc., 1990
Aldrich Chemical Company Inc.,
Catalog Handbook of Fine Chemicals, Aldrich Chemical Company, Inc., Milwaukee WI, 1990, 1. [all data]
Andreevskii, Kabo, et al., 1974
Andreevskii, D.N.; Kabo, G.Ya.; Esipenok, G.E.,
Equilibria and thermodynamics of the isomerisation of methylchloropentanes,
Russ. J. Phys. Chem. (Engl. Transl.), 1974, 48, 955. [all data]
Castello and D'Amato, 1986
Castello, G.; D'Amato, G.,
Gas chromatographic separation and identification of linear and branched-chain alkyl chlorides,
J. Chromatogr., 1986, 354, 65-74, https://doi.org/10.1016/S0021-9673(01)87011-4
. [all data]